�s�撬���R�[�h,NO,�s���{����,�s�撬����,����,����_�J�i,����_�ʏ�,����_�p��,����������,���,�ꏊ����,�Z��,����,�ܓx,�o�x,�d�b�ԍ�,�����ԍ�,�����i���j,�����i�P�ʁj,�@�l�ԍ�,���L�ғ�,�������w���,���p�\�j��,�J�n����,�I������,���p�\�������L����,�摜,�摜_���C�Z���X,�T�v,�T�v_�p��,����,����_�p��,URL,���l
232076,1,���m��,�L��s,�����{�{�a,�n�`�}���O�E�z���f��,,,�d�v������,������,�����{,�L��s�������{��16,,34.838168,137.339828,0533 88 8035,,1,��,,�����{,1907/5/27,��;��;��;��;��;�y;��,,,,,,,,,,,
232076,2,���m��,�L��s,�O�����O�d��,�T���~���E�W�T���W���E�m�g�E,,,�d�v������,������,�O����,�L��s�L�쒬�g��37,,34.820772,137.399138,0533 88 8035,,1,��,,�O����,1907/5/27,��;��;��;��;��;�y;��,,,,,,,,,,,
232076,3,���m��,�L��s,�ؑ��n����F����,���N�]�E�W�]�E�{�T�c�����E�]�E,,,�d�v������,���p�H�|�i,������,�L��s�L�쒬1,,34.825215,137.393285,0533 88 8035,,2,��,,������,1914/8/25,��;��;��;��;��;�y;��,,,,,,,,,,,
232076,4,���m��,�L��s,���{���F���{��䶗��},�P���|���`���N�V���N�I�E�L���E�}���_���Y,,,�d�v������,���p�H�|�i,�剶��,�L��s��Ò��L�Ό�ÎR�T,,34.820185,137.310512,0533 88 8035,,1,��,,�剶��,1918/4/8,,,,,,,,,,,,
232076,5,���m��,�L��s,����,�h�E�V���E,,,�d�v������,���p�H�|�i,������,�L��s�������{��31,,34.838179,137.342377,0533 88 8035,,1,��,,������,1922/7/15,��;��;��;��;��;�y;��,,,,,,,,,,,
232076,6,���m��,�L��s,�O�͍�������,�~�J���R�N�u���W�A�g,,,�j��,,�O�͍�������,�L��s�������{���n��,,34.838179,137.342377,0533 88 8035,,,,,�L��s,1922/10/12,��;��;��;��;��;�y;��,,,,,,,,,,,
232076,7,���m��,�L��s,�O�͍����򎛐�,�~�J���R�N�u���j�W�A�g,,,�j��,,�O�͍����򎛐�,�L��s�������E�n�n��,,34.840316,137.344863,0533 88 8035,,,,,�L��s,1922/10/12,��;��;��;��;��;�y;��,,,,,,,,,,,
232076,8,���m��,�L��s,�ؑ����ω�����,���N�]�E�Z���W���J���m�������E�]�E,,,�d�v������,���p�H�|�i,�@�Z��,�L��s��Ò��ԍ��S�X61,,34.819254,137.300868,0533 88 8035,,1,��,,�@�Z��,1931/12/14,����17��,,,,,,,,,,,
232076,9,���m��,�L��s,���v�ۂ̃i�M,�E�V�N�{�m�i�M,,,�V�R�L�O��,,�F��_��,�L��s�����R�������L��87,,34.3807169,137.380444,0533 88 8035,,1,��,,�F��_��,1938/12/14,��;��;��;��;��;�y;��,,,,,,,,,,,
232076,10,���m��,�L��s,����̃}�c����,�S���m�}�c�i�~�L,,,�V�R�L�O��,,����̃}�c����,�L��s������n��,,34.850969,137.313543,0533 88 8035,,,,,���m���ق�,1944/11/7,��;��;��;��;��;�y;��,,,,,,,,,,,
232076,11,���m��,�L��s,�O�����{�����{�a,�T���~���E�W�z���h�E�i�C�N�E�f��,,,�d�v������,������,�O����,�L��s�L�쒬�g��37,,34.820204,137.399554,0533 88 8035,,1,��,,�O����,1953/3/31,,,,,,,,,,,,
232076,12,���m��,�L��s,��ʎ�o,�_�C�n���j���L���E,,,�d�v������,,�p���_��,�L��s����䒬�{�e�Q,,34.797333,137.365856,0533 88 8035,,585,��,,�p���_��,1961/6/30,,,,,,,,,,,,
232076,13,���m��,�L��s,�ؑ������͎m����,���N�]�E�R���S�E���L�V�����E�]�E,,,�d�v������,���p�H�|�i,���ꎛ,�L��s���꒬�ω��R�R,,34.870852,137.357308,0533 88 8035,,2,��,,���ꎛ,1980/6/6,��;��;��;��;��;�y;��,,,,,,,,,,,
232076,14,���m��,�L��s,���ꎛ�m����E�{�����~�q,�U�C�K�W�j�I�E�����E�z���h�E�i�C�Y�V,,,�d�v������,������,���ꎛ,�L��s���꒬�ω��R�R,,34.870852,137.357308,0533 88 8035,,2,��,,���ꎛ,1990/3/19,��;��;��;��;��;�y;��,,,,,,,,,,,
232076,15,���m��,�L��s,�e�ԕ��O����@�O�g,�L�b�J�����T���W�R�@�^���o,,,�d�v������,���p�H�|�i,���m���������p��,���m�����ˎs��R����234,,35.185763,137.097775,0561 84 7474,,1,��,,�l,2005/6/9,,,,,,,,,,,,
232076,16,���m��,�L��s,�剶���R��,�_�C�I���W�T������,,,���w�蕶����,������,�剶��,�L��s��Ò��L�Ό�ÎR�T,,34.820185,137.310512,0533 88 8035,,1,��,,�剶��,1954/2/5,��;��;��;��;��;�y;��,,,,,,,,,,,
232076,17,���m��,�L��s,����,�N������,,,���w�蕶����,������,������,�L��s�������17,,34.876107,137.320623,0533 88 8035,,1,��,,������,1955/7/1,��;��;��;��;��;�y;��,,,,,,,,,,,
232076,18,���m��,�L��s,�O�����{��,�T���~���E�W�z���h�E,,,���w�蕶����,������,�O����,�L��s�L�쒬�g��37,,34.820204,137.399554,0533 88 8035,,1,��,,�O����,1992/2/28,��;��;��;��;��;�y;��,,,,,,,,,,,
232076,19,���m��,�L��s,�@�̐},�n�X�m�Y,,,���w�蕶����,���p�H�|�i,�剶��,�L��s��Ò��L�Ό�ÎR�T,,34.820185,137.310512,0533 88 8035,,2,����,,�剶��,1958/6/21,,,,,,,,,,,,
232076,20,���m��,�L��s,����ɓ��ܕ�F���}�},�A�~�_�j�W���E�S�{�T�c���C�S�E�Y,,,���w�蕶����,���p�H�|�i,�剶��,�L��s��Ò��L�Ό�ÎR�T,,34.820185,137.310512,0533 88 8035,,3,����,,�剶��,1958/6/21,,,,,,,,,,,,
232076,21,���m��,�L��s,���{���F�߉ޔ@����,�P���|���`���V���N�V���J�j�����C�]�E,,,���w�蕶����,���p�H�|�i,���@��,�L��s�ԍ⒬����69,,34.846546,137.306114,0533 88 8035,,1,��,,���@��,1981/11/20,,,,,,,,,,,,
232076,22,���m��,�L��s,�ؑ��@�C���Տё�,���N�]�E�V���E�e�C�`���E�G�L�V���E�]�E,,,���w�蕶����,���p�H�|�i,������,�L��s�������17,,34.876107,137.320623,0533 88 8035,,1,��,,������,1955/7/1,,,,,,,,,,,,
232076,23,���m��,�L��s,�ؑ����ω�����,���N�]�E�Z�C�J���m�������E�]�E,,,���w�蕶����,���p�H�|�i,������,�L��s�ԍ⒬����99,,34.854734,137.307891,0533 88 8035,,1,��,,������,1955/7/1,,,,,,,,,,,,
232076,24,���m��,�L��s,�ؑ������@���_�ЌËL�^��P��,���N�]�E�R�}�C�k�@�c�P�^���W���W���R�L���N�_�C�C�`�S�E,,,���w�蕶����,���p�H�|�i,�����u�~���[�W�A��,�L��s�����u��79�|2,,34.830118,137.389491,0533 88 8035,,1,��,,�F��_��,1957/1/12,,,,,,,,,,,,
232076,25,���m��,�L��s,�ؑ���t�@������,���N�]�E���N�V�j�����C�U�]�E,,,���w�蕶����,���p�H�|�i,������,�L��s�������{��31,,34.838179,137.342377,0533 88 8035,,1,��,,������,1957/1/12,,,,,,,,,,,,
232076,26,���m��,�L��s,�ؑ�����,���N�]�E�R�}�C�k,,,���w�蕶����,���p�H�|�i,�����u�~���[�W�A��,�L��s�����u��79�|2,,34.830118,137.389491,0533 88 8035,,1,��,,�����{,1958/3/29,,,,,,,,,,,,
232076,27,���m��,�L��s,�ؑ�����ɔ@������,���N�]�E�A�~�_�j�����C�U�]�E,,,���w�蕶����,���p�H�|�i,�l��,,,,,0533 88 8035,,1,��,,�l��,1958/3/29,,,,,,,,,,,,
232076,28,���m��,�L��s,�ؑ�����ɔ@������,���N�]�E�A�~�_�j�����C�U�]�E,,,���w�蕶����,���p�H�|�i,�����u�~���[�W�A��,�L��s�����u��79�|2,,34.830118,137.389491,0533 88 8035,,1,��,,���ꎛ,1978/3/15,��;��;��;��;�y;��,,,,,,,,,,,
232076,29,���m��,�L��s,�ؑ��󊥈���ɔ@������,���N�]�E�z�E�J���A�~�_�j�����C�U�]�E,,,���w�蕶����,���p�H�|�i,���ꎛ,�L��s���꒬�ω��R�R,,34.870852,137.357308,0533 88 8035,,1,��,,���ꎛ,1996/3/18,��;��;��;��;��;�y;��,,,,,,,,,,,
232076,30,���m��,�L��s,����,�V���W���E,,,���w�蕶����,���p�H�|�i,������,�L��s�������17,,34.876107,137.320623,0533 88 8035,,1,��,,������,1955/7/1,,,,,,,,,,,,
232076,31,���m��,�L��s,�ؒ��V�F�󔄖���,�L�{���A���m�E�Y���m�~�R�g����,,,���w�蕶����,���p�H�|�i,�����u�~���[�W�A��,�L��s�����u��79�|2,,34.830118,137.389491,0533 88 8035,,1,��,,�����{,1958/6/21,,,,,,,,,,,,
232076,32,���m��,�L��s,����,�{���V���E,,,���w�蕶����,���p�H�|�i,�p���_��,�L��s����䒬�{�e�Q,,34.797333,137.365856,0533 88 8035,,1,��,,�p���_��,1964/10/14,,,,,,,,,,,,
232076,33,���m��,�L��s,�痼�̓���,�`�M���m�h�E�^�N,,,���w�蕶����,���p�H�|�i,�����u�~���[�W�A��,�L��s�����u��79�|2,,34.830118,137.389491,0533 88 8035,,1,��,,�����_��,1963/4/19,��;��;��;��;�y;��,,,,,,,,,,,
232076,34,���m��,�L��s,�L�΂̓���,�q���C�V�m�h�E�^�N,,,���w�蕶����,���p�H�|�i,�l��,,,,,0533 88 8035,,1,��,,�l��,1974/7/3,,,,,,,,,,,,
232076,35,���m��,�L��s,�c��̓���,�_�~�l�m�h�E�^�N,,,���w�蕶����,���p�H�|�i,�u���_��,�L��s��{�����_��2,,34.84775,137.420809,0533 88 8035,,1,��,,�u���_��,1975/6/16,,,,,,,,,,,,
232076,36,���m��,�L��s,�C�b�������i�t�S���j,�J�C�W���E�u�h�E�L���E�i�c�P�^���e�b�g�E�j,,,���w�蕶����,���p�H�|�i,�����u�~���[�W�A��,�L��s�����u��79�|2,,34.830118,137.389491,0533 88 8035,,1,��,,�L��s,1979/6/13,��;��;��;��;�y;��,,,,,,,,,,,
232076,37,���m��,�L��s,���R�W�t��t��,�g���`���E�t�^�c�L�_�C�c�L�c�{,,,���w�蕶����,���p�H�|�i,�����u�~���[�W�A��,�L��s�����u��79�|2,,34.830118,137.389491,0533 88 8035,,1,��,,�L��s,1993/2/26,��;��;��;��;�y;��,,,,,,,,,,,
232076,38,���m��,�L��s,�p���_�Ѝ՗�Ö�,�E�^���W���W���T�C���C�R����,,,���w��L�`����������,���p�H�|�i,�p���_��,�L��s����䒬�{�e�Q,,34.797333,137.365856,0533 88 8035,,5,��,,�p���_��,1965/5/21,,,,,,,,,,,,
232076,39,���m��,�L��s,�Z�z,�T���K�N,,,���w��L�`����������,���p�H�|�i,�����u�~���[�W�A��,�L��s�����u��79�|2,,34.830118,137.389491,0533 88 8035,,3,��,,���n�_��,1999/11/26,,,,,,,,,,,,
232076,40,���m��,�L��s,�p���_�Ђ̓c�Ղ�,�E�^���W���W���m�^�}�c��,,,���w�薳�`����������,���̑�,�p���_��,�L��s����䒬�{�e�Q,,34.797333,137.365856,0533 88 8035,,,,,�p���_��,1954/3/12,������V��,,,,,,,,,,,
232076,41,���m��,�L��s,�i�Y�_�Ђ̕�[�j��,�X�T�m�I�W���W���m�z�E�m�E�c�i�r,,,���w�薳�`����������,���̑�,�L��i�Y�_��,�L��s�L�쐼��134,,34.826093,137.396466,0533 88 8035,,,,,�L��i�Y�_��,1968/3/11,�V��20���O��̓y,,,,,,,,,,,
232076,42,���m��,�L��s,���v�ۂ̎�t��,�E�V�N�{�m���J�o�T�C,,,���w�薳�`����������,���̑�,������,�L��s���v�ے����164,,34.812944,137.383454,0533 88 8035,,,,,������,2009/1/23,4��7�A8���ɋ߂��y;��,,,,,,,,,,,
232076,43,���m��,�L��s,�Y�ČÕ��Q,�X�~���L�R�t���O��,,,���w��j��,,�Y�ČÕ��Q,�L��s���㒬�Y�ĕ�,,34.879786,137.433142,0533 88 8035,,5,��,,�L��s,1954/3/12,��;��;��;��;��;�y;��,,,,,,,,,,,
232076,44,���m��,�L��s,�����R�����Õ��Q,�n�^�K�V�����}�I�l�R�t���O��,,,���w��j��,,�����R�����Õ��Q,�L��s���򒬓����E�V��s������,,34.86101,137.456989,0533 88 8035,,24,��,,����䉒�g�A�V��s�������,1978/5/29,��;��;��;��;��;�y;��,,,,,,,,,,,
232076,45,���m��,�L��s,��~���̃V�_���U�N��,�z�E�G���W�m�V�_���U�N��,,,���w��V�R�L�O��,,��~��,�L��s�㒷�R���c��33,,34.879738,137.417575,0533 88 8035,,1,��,,��~��,1966/1/17,��;��;��;��;��;�y;��,,,,,,,,,,,
232076,46,���m��,�L��s,�u���_�Љ��{�i�{�{�R�j�̎Бp,�g�K�W���W���I�N�~���i�z���O�E�T���j�m�V���\�E,,,���w��V�R�L�O��,,�u���_�Љ��{,�L��s�㒷�R���{�{��4,,34.905954,137.421681,0533 88 8035,,,,,�u���_��,1972/6/7,��;��;��;��;��;�y;��,,,,,,,,,,,
232076,47,���m��,�L��s,�u���_�Ђ̃P���L,�g�K�W���W���m�P���L,,,���w��V�R�L�O��,,�u���_��,�L��s��{�����_��2,,34.84775,137.420809,0533 88 8035,,1,��,,�u���_��,1972/6/7,��;��;��;��;��;�y;��,,,,,,,,,,,
232076,48,���m��,�L��s,���c�A��,�I�^�E�G�}�c��,,,�s�w�薳�`����������,���̑�,���ꎛ,�L��s���꒬�ω��R�R,,34.870852,137.357308,0533 88 8035,,,,,���ꎛ,1965/7/1,1��3��,,,,,,,,,,,
232076,49,���m��,�L��s,�D�R�Õ�,�t�i���}�R�t��,,,�s�w��j��,,�D�R�Õ�,�L��s��������h�n��,,34.838938,137.330322,0533 88 8035,,1,��,,�L��s,1965/7/1,��;��;��;��;��;�y;��,,,,,,,,,,,
232076,50,���m��,�L��s,�ؑ��S����,���N�]�E�q���N�}���g�E,,,�s�w��L�`������,���p�H�|�i,�Ԉ䎛,�L��s�Ԉ䒬13�Ԓn10,,34.815781,137.391959,0533 88 8035,,1,��,,�Ԉ䎛,1968/10/1,,,,,,,,,,,,
232076,51,���m��,�L��s,����,�h�E�V���E,,,�s�w��L�`������,���p�H�|�i,����_��,�L��s���{���I��19,,34.835856,137.322145,0533 88 8035,,1,��,,����_��,1968/10/1,,,,,,,,,,,,
232076,52,���m��,�L��s,����`�����g��i���R��B�j,�C�}�K�����V���g�A���h�W���E�i�n�N�T���Z���_�c�j,,,�s�w��L�`������,,���ꎛ,�L��s���꒬�ω��R�R,,34.870852,137.357308,0533 88 8035,,1,��,,���ꎛ,1968/10/1,,,,,,,,,,,,
232076,53,���m��,�L��s,����`�����g��i���̈��g�j,�C�}�K�����V���g�A���h�W���E�i�W�����E�A���h�j,,,�s�w��L�`������,,���ꎛ,�L��s���꒬�ω��R�R,,34.870852,137.357308,0533 88 8035,,1,��,,���ꎛ,1968/10/1,,,,,,,,,,,,
232076,54,���m��,�L��s,���쎁�^���g��,�C�}�K���E�W�U�l�A���h�W���E,,,�s�w��L�`������,,�����{,�L��s�������{��16,,34.838168,137.339828,0533 88 8035,,1,��,,�����{,1968/10/1,,,,,,,,,,,,
232076,55,���m��,�L��s,���쎁�^���D,�C�}�K���E�W�U�l�Z�C�T�c,,,�s�w��L�`������,,�����u�~���[�W�A��,�L��s�����u��79�|2,,34.830118,137.389491,0533 88 8035,,1,��,,�����{,1968/10/1,,,,,,,,,,,,
232076,56,���m��,�L��s,����`�����g��,�C�}�K�����V���g�A���h�W���E,,,�s�w��L�`������,,�����u�~���[�W�A��,�L��s�����u��79�|2,,34.830118,137.389491,0533 88 8035,,1,��,,�����{,1968/10/1,,,,,,,,,,,,
232076,57,���m��,�L��s,�ʗю��̃N�X,�M���N�����W�m�N�X,,,�s�w��V�R�L�O��,,�ʗю�,�L��s�����c������26,,34.834677,137.420202,0533 88 8035,,1,��,,�ʗю�,1968/10/1,��;��;��;��;��;�y;��,,,,,,,,,,,
232076,58,���m��,�L��s,�ؑ�������V����,���N�]�E�r�V�������e�������E�]�E,,,�s�w��L�`������,���p�H�|�i,���ю�,�L��s���������28�E32�����n,,34.845494,137.315307,0533 88 8035,,1,��,,���ю�,1972/11/30,,,,,,,,,,,,
232076,59,���m��,�L��s,�ؑ�����ɔ@������,���N�]�E�A�~�_�j�����C�����E�]�E,,,�s�w��L�`������,���p�H�|�i,���ю�,�L��s���������28�E32�����n,,34.845494,137.315307,0533 88 8035,,1,��,,���ю�,1972/11/30,,,,,,,,,,,,
232076,60,���m��,�L��s,�ؑ��ʋ�������,���N�]�E�Z�C�����R���S�E�����E�]�E,,,�s�w��L�`������,���p�H�|�i,���ю�,�L��s���������28�E32�����n,,34.845494,137.315307,0533 88 8035,,1,��,,���ю�,1972/11/30,,,,,,,,,,,,
232076,61,���m��,�L��s,����ɎO���摜,�A�~�_�T���]���K�]�E,,,�s�w��L�`������,���p�H�|�i,���ю�,�L��s���������28�E32�����n,,34.845494,137.315307,0533 88 8035,,1,��,,���ю�,1972/11/30,,,,,,,,,,,,
232076,62,���m��,�L��s,���}����ɎO���摜,���C�S�E�A�~�_�T���]���K�]�E,,,�s�w��L�`������,���p�H�|�i,���ю�,�L��s���������28�E32�����n,,34.845494,137.315307,0533 88 8035,,1,��,,���ю�,1972/11/30,,,,,,,,,,,,
232076,63,���m��,�L��s,�ؑ��ܑ喾����,���N�]�E�S�_�C�~���E�I�E�]�E,,,�s�w��L�`������,���p�H�|�i,���ꎛ,�L��s���꒬�ω��R�R,,34.870852,137.357308,0533 88 8035,,5,��,,���ꎛ,1972/11/30,,,,,,,,,,,,
232076,64,���m��,�L��s,�ؑ��n����F����,���N�]�E�W�]�E�{�T�c�����E�]�E,,,�s�w��L�`������,���p�H�|�i,���ꎛ,�L��s���꒬�ω��R�R,,34.870852,137.357308,0533 88 8035,,1,��,,���ꎛ,1972/11/30,,,,,,,,,,,,
232076,65,���m��,�L��s,�s�������O���摜,�t�h�E�~���E�I�E�T���]���K�]�E,,,�s�w��L�`������,���p�H�|�i,���ꎛ,�L��s���꒬�ω��R�R,,34.870852,137.357308,0533 88 8035,,1,��,,���ꎛ,1972/11/30,,,,,,,,,,,,
232076,66,���m��,�L��s,�s�������摜,�t�h�E�~���E�I�E�K�]�E,,,�s�w��L�`������,���p�H�|�i,���ꎛ,�L��s���꒬�ω��R�R,,34.870852,137.357308,0533 88 8035,,1,��,,���ꎛ,1972/11/30,,,,,,,,,,,,
232076,67,���m��,�L��s,�ؑ�����ɔ@������,���N�]�E�A�~�_�j�����C�����E�]�E,,,�s�w��L�`������,���p�H�|�i,�@�_��,�L��s������������73,,34.833268,137.336,0533 88 8035,,1,��,,�@�_��,1972/11/30,,,,,,,,,,,,
232076,68,���m��,�L��s,�ؑ������n����F���摜,���N�]�E�G�����C�W�]�E�{�T�c�n���J�]�E,,,�s�w��L�`������,���p�H�|�i,�@�_��,�L��s������������73,,34.833268,137.336,0533 88 8035,,1,��,,�@�_��,1972/11/30,,,,,,,,,,,,
232076,69,���m��,�L��s,�ؑ�����ɔ@������,���N�]�E�A�~�_�j�����C�U�]�E,,,�s�w��L�`������,���p�H�|�i,������,�L��s���������O7,,34.844791,137.328328,0533 88 8035,,1,��,,������,1972/11/30,,,,,,,,,,,,
232076,70,���m��,�L��s,�R�{�����̕�,���}���g�J���X�P�m�n�J,,,�s�w��j��,,���J��,�L��s���v�ے�������97,,34.813663,137.379199,0533 88 8035,,,,,���J��,1972/11/30,��;��;��;��;��;�y;��,,,,,,,,,,,
232076,71,���m��,�L��s,�ؑ������x�V�R��,���N�]�E�}���V�e���L�]�E,,,�s�w��L�`������,���p�H�|�i,���J��,�L��s���v�ے�������97,,34.813663,137.379199,0533 88 8035,,1,��,,���J��,1972/11/30,,,,,,,,,,,,
232076,72,���m��,�L��s,�ؑ����}����ɔ@������,���N�]�E���C�S�E�A�~�_�j�����C�����E�]�E,,,�s�w��L�`������,���p�H�|�i,������,�L��s���L��1����59,,34.826802,137.398057,0533 88 8035,,1,��,,������,1972/11/30,,,,,,,,,,,,
232076,73,���m��,�L��s,�����摜,���J���K�]�E,,,�s�w��L�`������,���p�H�|�i,������,�L��s���L��1����59,,34.826802,137.398057,0533 88 8035,,1,��,,������,1972/11/30,,,,,,,,,,,,
232076,74,���m��,�L��s,����ɎO���摜,�A�~�_�T���]���K�]�E,,,�s�w��L�`������,���p�H�|�i,������,�L��s���L��1����59,,34.826802,137.398057,0533 88 8035,,1,��,,������,1972/11/30,,,,,,,,,,,,
232076,75,���m��,�L��s,�ؑ��\��ʊω���F����,���N�]�E�W���E�C�`�����J���m���{�T�c�����E�]�E,,,�s�w��L�`������,���p�H�|�i,�ω���,�L��s���L��2���ڒn��,,34.827249,137.40136,0533 88 8035,,1,��,,�ω���,1972/11/30,,,,,,,,,,,,
232076,76,���m��,�L��s,�q�쐬����_,�}�L�m�i���T�_�R�E�r���E,,,�s�w��j��,,�q�쐬����_,�L��s��Β�4���ڒn��,,34.814988,137.375847,0533 88 8035,,,,,���P�@,1972/11/30,��;��;��;��;��;�y;��,,,,,,,,,,,
232076,77,���m��,�L��s,�������ӕ���,�Z�C�h�E�d�N���~���N�u�b�g�E,,,�s�w��L�`������,���p�H�|�i,�P����,�L��s����2���ڒn��,,34.811704,137.377643,0533 88 8035,,1,��,,�P����,1972/11/30,,,,,,,,,,,,
232076,78,���m��,�L��s,�ؑ����ω���F����,���N�]�E�Z�C�J���m���{�T�c�����E�]�E,,,�s�w��L�`������,���p�H�|�i,�����u�~���[�W�A��,�L��s�����u��79�|2,,34.830118,137.389491,0533 88 8035,,1,��,,�P����,1972/11/30,,,,,,,,,,,,
232076,79,���m��,�L��s,�\��,�m�E����,,,�s�w��L�`������,���p�H�|�i,�L��i�Y�_��,�L��s�L�쐼��134,,34.826093,137.396466,0533 88 8035,,14,��,,�L��i�Y�_��,1972/11/30,,,,,,,,,,,,
232076,80,���m��,�L��s,�ؑ���t�@������,���N�]�E���N�V�j�����C�U�]�E,,,�s�w��L�`������,���p�H�|�i,������,�L��s���v�ے���q19,,34.812491,137.38189,0533 88 8035,,1,��,,������,1972/11/30,,,,,,,,,,,,
232076,81,���m��,�L��s,�ؑ��n����F����,���N�]�E�W�]�E�{�T�c�����E�]�E,,,�s�w��L�`������,���p�H�|�i,�Ԉ䎛,�L��s�Ԉ䒬13�Ԓn10,,34.815781,137.391959,0533 88 8035,,1,��,,�Ԉ䎛,1973/3/6,,,,,,,,,,,,
232076,82,���m��,�L��s,�ؑ�������V����,���N�]�E�r�V�������e�������E�]�E,,,�s�w��L�`������,���p�H�|�i,�Ԉ䎛,�L��s�Ԉ䒬13�Ԓn10,,34.815781,137.391959,0533 88 8035,,1,��,,�Ԉ䎛,1973/3/6,,,,,,,,,,,,
232076,83,���m��,�L��s,�ؑ���ʓV����,���N�]�E�C�_�e�������E�]�E,,,�s�w��L�`������,���p�H�|�i,�Ԉ䎛,�L��s�Ԉ䒬13�Ԓn10,,34.815781,137.391959,0533 88 8035,,1,��,,�Ԉ䎛,1973/3/6,,,,,,,,,,,,
232076,84,���m��,�L��s,�����������ʎ�g�����o,�J�i�K�L�R���S�E�n���j���n���~�c�L���E,,,�s�w��L�`������,,�Ԉ䎛,�L��s�Ԉ䒬13�Ԓn10,,34.815781,137.391959,0533 88 8035,,1,��,,�Ԉ䎛,1973/3/6,,,,,,,,,,,,
232076,85,���m��,�L��s,�ؑ����ʁE����,���N�]�E�I�L�i�����E�t�N����,,,�s�w��L�`������,���p�H�|�i,�����u�~���[�W�A��,�L��s�����u��79�|2,,34.830118,137.389491,0533 88 8035,,2,��,,�ɒm���_��,1973/3/6,,,,,,,,,,,,
232076,86,���m��,�L��s,�q��O�Y���Y��i��,�}�L�m�T�u���E�W���E�L�V���W���E,,,�s�w��L�`������,,�����u�~���[�W�A��,�L��s�����u��79�|2,,34.830118,137.389491,0533 88 8035,,1,��,,�����{,1976/10/30,,,,,,,,,,,,
232076,87,���m��,�L��s,�q��c�O���M����i��,�}�L�m�f���]�E�^�C���m�m�u�i���L�V���W���E,,,�s�w��L�`������,,�����u�~���[�W�A��,�L��s�����u��79�|2,,34.830118,137.389491,0533 88 8035,,1,��,,�����{,1976/10/30,,,,,,,,,,,,
232076,88,���m��,�L��s,�M�ߊ�i��,�m�u�`�J�L�V���W���E,,,�s�w��L�`������,,�����u�~���[�W�A��,�L��s�����u��79�|2,,34.830118,137.389491,0533 88 8035,,1,��,,�����{,1976/10/30,,,,,,,,,,,,
232076,89,���m��,�L��s,�q�쐬�q��i��,�}�L�m�i���g�V�L�V���W���E,,,�s�w��L�`������,,�����u�~���[�W�A��,�L��s�����u��79�|2,,34.830118,137.389491,0533 88 8035,,1,��,,�����{,1976/10/30,,,,,,,,,,,,
232076,90,���m��,�L��s,�q�쐬�q��i��,�}�L�m�i���g�V�L�V���W���E,,,�s�w��L�`������,,�����u�~���[�W�A��,�L��s�����u��79�|2,,34.830118,137.389491,0533 88 8035,,1,��,,�����{,1976/10/30,,,,,,,,,,,,
232076,91,���m��,�L��s,�q�얯���啽������i��,�}�L�m�~���u�m�W���E�^�C���m�i���J�c�L�V���W���E,,,�s�w��L�`������,,�����u�~���[�W�A��,�L��s�����u��79�|2,,34.830118,137.389491,0533 88 8035,,1,��,,�����{,1976/10/30,,,,,,,,,,,,
232076,92,���m��,�L��s,����`�����g��,�C�}�K�����V���g�A���h�W���E,,,�s�w��L�`������,,�����u�~���[�W�A��,�L��s�����u��79�|2,,34.830118,137.389491,0533 88 8035,,1,��,,�O����,1976/10/30,,,,,,,,,,,,
232076,93,���m��,�L��s,���쎁�^���g��,�C�}�K���E�W�U�l�A���h�W���E,,,�s�w��L�`������,,�����u�~���[�W�A��,�L��s�����u��79�|2,,34.830118,137.389491,0533 88 8035,,1,��,,�O����,1976/10/30,,,,,,,,,,,,
232076,94,���m��,�L��s,����ƍN���g��,�g�N�K���C�G���X�A���h�W���E,,,�s�w��L�`������,,�����u�~���[�W�A��,�L��s�����u��79�|2,,34.830118,137.389491,0533 88 8035,,1,��,,�O����,1976/10/30,,,,,,,,,,,,
232076,95,���m��,�L��s,����`�����g��,�C�}�K�����V���A���h�W���E,,,�s�w��L�`������,,�����u�~���[�W�A��,�L��s�����u��79�|2,,34.830118,137.389491,0533 88 8035,,1,��,,���ꎛ,1976/10/30,,,,,,,,,,,,
232076,96,���m��,�L��s,���쎁�^���g��i�i�\�R�N�j,�C�}�K���E�W�U�l�A���h�W���E�i�G�C���N�T���l���j,,,�s�w��L�`������,,�����u�~���[�W�A��,�L��s�����u��79�|2,,34.830118,137.389491,0533 88 8035,,1,��,,���ꎛ,1976/10/30,,,,,,,,,,,,
232076,97,���m��,�L��s,���쎁�^���g��i�i�\�S�N�j,�C�}�K���E�W�U�l�A���h�W���E�i�G�C���N���l���j,,,�s�w��L�`������,,�����u�~���[�W�A��,�L��s�����u��79�|2,,34.830118,137.389491,0533 88 8035,,1,��,,���ꎛ,1976/10/30,,,,,,,,,,,,
232076,98,���m��,�L��s,���쎁�^���g��,�C�}�K���E�W�U�l�A���h�W���E,,,�s�w��L�`������,,�����u�~���[�W�A��,�L��s�����u��79�|2,,34.830118,137.389491,0533 88 8035,,1,��,,�吹��,1976/10/30,,,,,,,,,,,,
232076,99,���m��,�L��s,����`�����揊,�C�}�K�����V���g�R�E�{�V��,,,�s�w��j��,,�吹��,�L��s���v�ے��ݑg66,,34.811099,137.384882,0533 88 8035,,1,��,,�吹��,1976/10/30,��;��;��;��;��;�y;��,,,,,,,,,,,
232076,100,���m��,�L��s,�m�ԋ��,�o�V���E�N�q,,,�s�w��j��,,�m�ԋ��,�L��s�����������n��,,34.839448,137.32878,0533 88 8035,,1,��,,������,1976/10/30,��;��;��;��;��;�y;��,,,,,,,,,,,
232076,101,���m��,�L��s,�������̃��b�R�N,�T�C�~���E�W�m���b�R�N,,,�s�w��V�R�L�O��,,������,�L��s���������O7,,34.844791,137.328328,0533 88 8035,,1,��,,������,1977/4/20,��;��;��;��;��;�y;��,,,,,,,,,,,
232076,102,���m��,�L��s,����h��ʎ����i�ꊇ�j,�S���V���N�R�E�c�E�V�����E�i�C�b�J�c�j,,,�s�w��L�`������,,�����u�~���[�W�A��,�L��s�����u��79�|2,,34.830118,137.389491,0533 88 8035,,5,�_,,����A��,1986/3/15,,,,,,,,,,,,
232076,103,���m��,�L��s,�����������i�ꊇ�j,�T�C�~���E�W�����W���i�C�b�J�c�j,,,�s�w��L�`������,,������,�L��s���������O7,,34.844791,137.328328,0533 88 8035,,1,��,,������,1986/3/15,,,,,,,,,,,,
232076,104,���m��,�L��s,�ؑ��ω���\�����O,���N�]�E�J���m����W���E�n�`�u�V���E,,,�s�w��L�`������,���p�H�|�i,���ꎛ,�L��s���꒬�ω��R�R,,34.870852,137.357308,0533 88 8035,,28,��,,���ꎛ,1991/9/11,,,,,,,,,,,,
232076,105,���m��,�L��s,�ؑ�����ɔ@������,���N�]�E�A�~�_�j�����C�����E�]�E,,,�s�w��L�`������,���p�H�|�i,�吹��,�L��s���v�ے��ݑg66,,34.811099,137.384882,0533 88 8035,,1,��,,�吹��,1991/9/11,,,,,,,,,,,,
232076,106,���m��,�L��s,����`����i��,�C�}�K�����V���g�L�V���W���E,,,�s�w��L�`������,,�Ԉ䎛,�L��s�Ԉ䒬13�Ԓn10,,34.815781,137.391959,0533 88 8035,,1,��,,�Ԉ䎛,1991/9/11,,,,,,,,,,,,
232076,107,���m��,�L��s,����`�����g��,�C�}�K�����V���g�A���h�W���E,,,�s�w��L�`������,,�Ԉ䎛,�L��s�Ԉ䒬13�Ԓn10,,34.815781,137.391959,0533 88 8035,,1,��,,�Ԉ䎛,1991/9/11,,,,,,,,,,,,
232076,108,���m��,�L��s,�O�͍���t��,�~�J���m�N�j�t�^�o�m�}�c,,,�s�w��L�`������,,����@,�L��s�����R���k��101,,34.80933,137.376713,0533 88 8035,,1,��,,����@,1993/8/12,,,,,,,,,,,,
232076,109,���m��,�L��s,�q����,�}�L�m�W���E�A�g,,,�s�w��j��,,�q����,�L��s�q�쒬�����n��,,34.825434,137.412022,0533 88 8035,,,,,�L��s,1995/2/13,��;��;��;��;��;�y;��,,,,,,,,,,,
232076,110,���m��,�L��s,���ꎛ�̃q���n���[�~�Ɛ����n,�U�C�K�W�m�q���n���[�~�g�Z�C�\�N�`,,,�s�w��V�R�L�O��,,���ꎛ,�L��s���꒬�ω��R�R,,34.870852,137.357308,0533 88 8035,,,,,���ꎛ,1995/2/13,��;��;��;��;��;�y;��,,,,,,,,,,,
232076,111,���m��,�L��s,����,�{���V���E,,,�s�w��L�`������,���p�H�|�i,�����u�~���[�W�A��,�L��s�����u��79�|2,,34.830118,137.389491,0533 88 8035,,1,��,,���ю�,2001/6/22,,,,,,,,,,,,
232076,112,���m��,�L��s,�k��,���j�N�`,,,�s�w��L�`������,���p�H�|�i,�����u�~���[�W�A��,�L��s�����u��79�|2,,34.830118,137.389491,0533 88 8035,,1,��,,�F��_��,2001/6/22,,,,,,,,,,,,
232076,113,���m��,�L��s,�k��,���j�N�`,,,�s�w��L�`������,���p�H�|�i,�����u�~���[�W�A��,�L��s�����u��79�|2,,34.830118,137.389491,0533 88 8035,,1,��,,�fᵖ_�Ёi�����j,2001/6/22,,,,,,,,,,,,
232076,114,���m��,�L��s,��R�����ǂ�,�I�h�����}�T�J�C�I�h��,,,�s�w�薳�`����������,���̑�,��R�����ǂ�ۑ���,,,,,0533 88 8035,,,,,��R�����ǂ�ۑ���,2001/6/22,,,,,,,,,,,,
232076,115,���m��,�L��s,����_�Ж{�a,�z�V�m�W���W���z���f��,,,�s�w�茚����,������,����_��,�L��s��������L��102,,34.849977,137.345355,0533 88 8035,,1,��,,����_��,2005/8/20,��;��;��;��;��;�y;��,,,,,,,,,,,
232076,116,���m��,�L��s,�����{�՗�p��,�n�`�}���O�E�T�C���C���E�O,,,�s�w��L�`������,���p�H�|�i,�����{,�L��s�������{��16,,34.838168,137.339828,0533 88 8035,,1,��,,�����{,2005/8/20,,,,,,,,,,,,
232076,117,���m��,�L��s,���̑�Ƃ��̕t�߂̎��R,�E�V�m�^�L�g�\�m�t�L���m�V�[��,,,�s�w�薼��,,���̑�,�L��s���㒬��m��,,34.88553,137.449261,0533 88 8035,,,,,?�J�_��,1967/4/1,��;��;��;��;��;�y;��,,,,,,,,,,,
232076,118,���m��,�L��s,�O���˂P����,�l���u�c�d�J�C�`�S�E�t��,,,�s�w��j��,,�O���˂P����,�L��s��ؒ��R�m���n��,,34.84995,137.388782,0533 88 8035,,1,��,,�����@,1967/4/1,��;��;��;��;��;�y;��,,,,,,,,,,,
232076,119,���m��,�L��s,���_�����,�X�C�W���r���C�Z�L,,,�s�w��j��,,���_�����,�L��s�㒷�R�����_���n��,,34.865198,137.434031,0533 88 8035,,,,,�L��s��,1967/4/1,��;��;��;��;��;�y;��,,,,,,,,,,,
232076,120,���m��,�L��s,��ʎ�o�Ƃ��̎��[��,�_�C�n���j���L���E�g�\�m�V���E�m�E�o�R,,,�s�w��L�`������,,�i�Y�_�Ёi��؁j,�L��s��ؒ��R�m��106,,34.859187,137.39527,0533 88 8035,,600�A6,���A��,,�i�Y�_�Ёi��؁j,1980/5/28,,,,,,,,,,,,
232076,121,���m��,�L��s,�͂�ɂႳ��,�n���j���T�},,,�s�w�薳�`����������,���̑�,,�L��s��ؒ��n��,,,,0533 88 8035,,,,,��؋�,1980/5/28,,,,,,,,,,,,
232076,122,���m��,�L��s,�ѐ�̃z�^��,�I�r�K���m�z�^��,,,�s�w��V�R�L�O��,,�ѐ�,�L��s��ؒ��n��,,34.856878,137.406784,0533 88 8035,,,,,��؋�,1980/5/28,�U����,,,,,,,,,,,
232076,123,���m��,�L��s,�O�͈�{�n���S,�~�J���C�`�m�~���W�c�L�E�^,,,�s�w�薳�`����������,���̑�,�n���S�ۑ���,,,,,0533 88 8035,,,,,�n���S�ۑ���,1982/3/29,,,,,,,,,,,,