�s���{���R�[�h���͎s�撬���R�[�h,NO,�s���{����,�s�撬����,����,����_�J�i,����_�ʏ�,POI�R�[�h,�Z��,����,�ܓx,�o�x,�d�b�ԍ�,�����ԍ�,�@�l�ԍ�,�c�̖�,���p�\�j��,�J�n����,�I������,���p�\���ԓ��L����,����,�o���A�t���[���,URL,�{�݋敪,���l
232319,0030215000,���m��,�c���s,�V�l����,�j�C�n�}�R�E�G��,,1003,�c���s�Z�A���V�l�n��,,34.64525403,137.3172104,,,,,,,,,,,,�����E�L��,
232319,0030215001,���m��,�c���s,�c�������^������,�^�n���g�E�u�E���h�E�R�E�G��,,1003,�c���s�Z�A���_�m��7-19�O,,34.65276232,137.2955624,,,,,,,,,,,,�����E�L��,
232319,0030215002,���m��,�c���s,�₮�ܑ�P������,���O�}�_�C�C�`�S�E�R�E�G��,,1003,�c���s�₮�ܑ�12-1,,34.6732219,137.3091005,,,,,,,,,,,,�����E�L��,
232319,0030215003,���m��,�c���s,�₮�ܑ�Q������,���O�}�_�C�j�S�E�R�E�G��,,1003,�c���s�₮�ܑ�27-7,,34.67123914,137.3072212,,,,,,,,,,,,�����E�L��,
232319,0030215004,���m��,�c���s,�c���s��ʌ���,�^�n���V�R�E�c�E�R�E�G��,,1003,�c���s�J�F���b�艮�O1-1,,34.66649349,137.298436,,,,,,,,,,,,�����E�L��,
232319,0030215005,���m��,�c���s,�΂��l����,�~�h���K�n�}�R�E�G��,,1003,�c���s�΂��l4-1-1�O,,34.69786059,137.2905904,0531-23-2663,,9180305002517,�c�����������g��,<���̋x�ٓ��͗��p�s��>���j��(�j���̏ꍇ�͗���)�A12/28����1/4�B,09:00,22:00,,,�D�撓�ԏ�L��;���ړI�g�C���L��,,�����E�L��,
232319,0030215006,���m��,�c���s,�΂��l�Q���Βn,�~�h���K�n�}�j�S�E�R�E�G��,�G�R�p�[�N,1003,�c���s�΂��l2��87�A88,,34.71975171,137.2688142,0531-23-2663,,9180305002517,�c�����������g��,,,,,,���ړI�g�C���L��,,�����E�L��,
232319,0030215007,���m��,�c���s,�P�������,�q���~�_�C�R�E�G��,,1003,�c���s�P����70,,34.70635659,137.2760044,,,,,,,,,,,,�����E�L��,
232319,0030215008,���m��,�c���s,�А��P������,�J�^�n�}�C�`�S�E�R�E�G��,,1003,�c���s�А��񒚖�83,,34.69461201,137.2610914,,,,,,,,,,,,�����E�L��,
232319,0030215009,���m��,�c���s,���J�C�l����,�V�����J�C�q���R�E�G��,,1003,�c���s���J������1�O,,34.68734375,137.2335828,0531-22-9841,,,���J��,<���̋x�ٓ��͗��p�s��>���j��(�j���̏ꍇ�͗���)�A12/28����1/4�B,08:00,,<�I������>4������9����19:00�A10������3����17:00,,�D�撓�ԏ�L��;���ړI�g�C���L��;�G���x�[�^�[�L��,,�����E�L��,
232319,0030215010,���m��,�c���s,���Y����,�j�V�E���R�E�G��,,1003,�c���s�Y���ێR1-19�O,,34.70198932,137.2729089,,,,,,,,,,�D�撓�ԏ�L��,,�����E�L��,
232319,0030215011,���m��,�c���s,�����R�W�]��,�U�I�E�e���{�E�_�C,,1003,�c���s�Y������1-46,,34.68437521,137.2617652,,,,,,,,,,,,�����E�L��,
232319,0030215012,���m��,�c���s,�����R�����̐X,�U�I�E�S���Q���m����,,1003,�c���s�c���������n��,,34.67884242,137.2609805,,,,,,,,,,�D�撓�ԏ�L��;���ړI�g�C���L��,,�����E�L��,
232319,0030215013,���m��,�c���s,���������u�S������,�U�I�E�q�K�V�K�I�J�����S�E�R�E�G��,,1003,�c���s�c�������3-288,,34.68055358,137.2702969,,,,,,,,,,,,�����E�L��,
232319,0030215014,���m��,�c���s,�����샖�u����,�U�I�E�~�i�~�K�I�J�R�E�G��,,1003,�c���s�c�������3-312,,34.67931866,137.2659297,,,,,,,,,,,,�����E�L��,
232319,0030215015,���m��,�c���s,�g�ӑ�Ȃ��悵����,���V�S�_�C�i�J���V�R�E�G��,,1003,�c���s�g�ӑ�꒚��123,,34.68458766,137.2765978,,,,,,,,,,,,�����E�L��,
232319,0030215016,���m��,�c���s,�g�ӊL�ˎj�Ռ���,���V�S�J�C�d�J�V�Z�L�R�E�G��,,1003,�c���s�g�Ӓ����42-4,,34.68194693,137.2804267,,,,,,,,,,,,�����E�L��,
232319,0030215017,���m��,�c���s,�ؖȑ����,�������_�C�R�E�G��,,1003,�c���s�g�Ӓ��ؖȑ�169,,34.68193587,137.2768098,,,,,,,,,,,,�����E�L��,
232319,0030215018,���m��,�c���s,�΂�����,�c�o�L�R�E�G��,,1003,�c���s�c�������R��17-1�O,,34.67567468,137.2638702,,,,,,,,,,�D�撓�ԏ�L��;���ړI�g�C���L��,,�����E�L��,
232319,0030215019,���m��,�c���s,��������,�`���E�I�E�R�E�G��,,1003,�c���s�L�������V�c1,,34.67127989,137.279083,0531-22-0003,,,,<���̋x�ٓ��͗��p�s��>���j��(�j���̏ꍇ�͗���)�A12/28����1/4�B,09:00,22:00,,,�D�撓�ԏ�L��;���ړI�g�C���L��,,�����E�L��,
232319,0030215020,���m��,�c���s,�͂Ȃ̂��L��,�n�i�m�L�q���o,,1003,�c���s�c��������5,,34.6722636,137.2734022,,,,,,,,,,,,�����E�L��,
232319,0030215021,���m��,�c���s,��������,�V�I�~�R�E�G��,,1003,�c���s�c��������2,,34.67272481,137.2730535,,,,,,,,,,���ړI�g�C���L��,,�����E�L��,
232319,0030215022,���m��,�c���s,������,�I�I�e�R�E�G��,,1003,�c���s�c�����a��46-1,,34.67114136,137.2680665,,,,,,,,,,���ړI�g�C���L��,,�����E�L��,
232319,0030215023,���m��,�c���s,�r�m������,�C�P�m�n���R�E�G��,,1003,�c���s�c���������H15-1�O,,34.67347326,137.2654571,,,,,,,,,,,,�����E�L��,
232319,0030215024,���m��,�c���s,�z�o����,�c�L�_�V�R�E�G��,,1003,�c���s�c�����z�o37-10,,34.67223079,137.2709523,,,,,,,,,,�D�撓�ԏ�L��,,�����E�L��,
232319,0030215025,���m��,�c���s,�ӓc����,�o���f���R�E�G��,,1003,�c���s�c�����ӓc97,,34.67754154,137.2721006,,,,,,,,,,,,�����E�L��,
232319,0030215026,���m��,�c���s,�ӓc��Q����,�o���f���_�C�j�R�E�G��,,1003,�c���s�c�����ӓc48-1,,34.67493735,137.2720644,,,,,,,,,,,,�����E�L��,
232319,0030215027,���m��,�c���s,�ꓪ��������,�^�L�K�V���\�E�S�E�R�E�G��,,1003,�c���s�c�����ꓪ10-1�O,,34.66953957,137.2447215,0531-22-3936,,,�c����,<���̋x�ٓ��͗��p�s��>���j��(�j���̏ꍇ�͗���)�A12/28����1/4�B,08:30,17:00,,,�D�撓�ԏ�L��;���ړI�g�C���L��,,�����E�L��,
232319,0030215028,���m��,�c���s,���ꓪ����,�q�K�V�^�L�K�V���R�E�G��,,1003,�c���s�c�������ꓪ1-107,,34.66840173,137.2482786,,,,,,,,,,,,�����E�L��,
232319,0030215029,���m��,�c���s,�V���J����,�V���Z�C���R�E�G��,,1003,�c���s�c�����V���J30,,34.66932276,137.2613813,,,,,,,,,,,,�����E�L��,
232319,0030215030,���m��,�c���s,�Ԑ΂P������,�A�J�C�V�C�`�S�E�R�E�G��,,1003,�c���s�ԐΈ꒚��43,,34.66562569,137.2658269,,,,,,,,,,,,�����E�L��,
232319,0030215031,���m��,�c���s,�Ԑ΂Q������,�A�J�C�V�j�S�E�R�E�G��,,1003,�c���s�ԐΎl����60,,34.66298566,137.2680879,,,,,,,,,,,,�����E�L��,
232319,0030215032,���m��,�c���s,�Ԑ΂R������,�A�J�C�V�T���S�E�R�E�G��,,1003,�c���s���ԐΎl����56,,34.66207035,137.2697398,,,,,,,,,,���ړI�g�C���L��,,�����E�L��,
232319,0030215033,���m��,�c���s,�Ԑ΂S������,�A�J�C�V�����S�E�R�E�G��,,1003,�c���s���ԐΓ񒚖�75,,34.66261558,137.2728501,,,,,,,,,,���ړI�g�C���L��,,�����E�L��,
232319,0030215034,���m��,�c���s,�Ԑ΂T������,�A�J�C�V�S�S�E�R�E�G��,,1003,�c���s���ԐΌܒ���22,,34.661568,137.273641,,,,,,,,,,,,�����E�L��,
232319,0030215035,���m��,�c���s,�_�ˉ^������,�J���x�E���h�E�R�E�G��,,1003,�c���s�_�˒��O��48,,34.65066796,137.276409,,,,,,,,,,,,�����E�L��,
232319,0030215036,���m��,�c���s,�_�ˑ�r���ӌ���,�J���x�I�I�C�P�~�Y�x�R�E�G��,,1003,�c���s�_�˒���r6-2�O,,34.65193881,137.2783288,,,,,,,,,,�i������,,�����E�L��,
232319,0030215037,���m��,�c���s,�_�ˑ�����,�J���x�_�C�C�`�R�E�G��,,1003,�c���s�_�˒��V���110,,34.66471821,137.2786894,,,,,,,,,,,,�����E�L��,
232319,0030215038,���m��,�c���s,�_�ˑ�����,�J���x�_�C�j����,,1003,�c���s�_�˒������61,,34.66669531,137.2800799,,,,,,,,,,,,�����E�L��,
232319,0030215039,���m��,�c���s,�V��ؗΒn,�V���I�I�c�{�R�E�G��,,1003,�c���s�_�˒��V���127,,34.66762418,137.2767187,,,,,,,,,,,,�����E�L��,
232319,0030215040,���m��,�c���s,�呐�c�n����,�I�I�N�T�_���`�R�E�G��,,1003,�c���s�呐���f��29-42,,34.6387048,137.2423402,,,,,,,,,,,,�����E�L��,
232319,0030215041,���m��,�c���s,�ق�Ƒ�P������,�z���g�_�C�C�`�S�E�R�E�G��,,1003,�c���s�ق�Ƒ�2-93�O,,34.66237851,137.2109185,,,,,,,,,,,,�����E�L��,
232319,0030215042,���m��,�c���s,�ق�Ƒ�Q������,�z���g�_�C�j�S�E�R�E�G��,,1003,�c���s�ق�Ƒ�2-100,,34.66327491,137.2094864,,,,,,,,,,,,�����E�L��,
232319,0030215043,���m��,�c���s,�ق�Ƒ�R������,�z���g�_�C�T���S�E�R�E�G��,,1003,�c���s�ق�Ƒ�1-65�O,,34.66216716,137.206852,,,,,,,,,,,,�����E�L��,
232319,0030215044,���m��,�c���s,�n�����ړI�L��,�}�O�T�^���N�e�L�q���o,,1003,�c���s��c���≺59-1,,34.66754997,137.1961364,,,,,,,,,,�i�������A�K�i����,,�����E�L��,
232319,0030215045,���m��,�c���s,���萼������,�R�E�T�L�Z�C�u�R�E�G��,,1003,�c���s����񒚖�1,,34.71103656,137.2751974,,,,,,,,,,,,�����E�L��,
232319,0030215046,���m��,�c���s,���蒆������,�R�E�T�L�`���E�I�E�R�E�G��,,1003,�c���s����꒚��4,,34.71085848,137.2796984,,,,,,,,,,,,�����E�L��,
232319,0030215047,���m��,�c���s,���蓌������,�R�E�T�L�g�E�u�R�E�G��,,1003,�c���s����O����12,,34.7114648,137.2839362,,,,,,,,,,,,�����E�L��,
232319,0030215048,���m��,�c���s,���������_���L��,�^�J�}�c�g�E�u�m�E�\���q���o,,1003,�c���s����������36,,34.62371175,137.242037,,,,,,,,,,�i�������A�K�i����,,�����E�L��,
232319,0030215049,���m��,�c���s,�����n��_���L��,�^�J�}�c�`�N�m�E�\���q���o,,1003,�c���s�������{����2-1,,34.6216816,137.2368059,,,,,,,,,,�i������,,�����E�L��,
232319,0030215050,���m��,�c���s,�ԉH�������L��,�A�J�o�l�u���J�q���o,,1003,�c���s������������443,,34.62598437,137.2212017,,,,,,,,,,,,�����E�L��,
232319,0030215051,���m��,�c���s,�ԓ��^���L��,�A�J�q�K�V�E���h�E�q���o,,1003,�c���s�ԉH�����ΓY74-1,,34.61667754,137.2080729,,,,,,,,,,,,�����E�L��,
232319,0030215052,���m��,�c���s,�ԉH�����R�p�[�N,�A�J�o�l���R�p�[�N,,1003,�c���s�ԉH�������n��,,34.60629473,137.1902544,,,,,,,,,,,,�����E�L��,
232319,0030215053,���m��,�c���s,�r�K�^���L��,�C�P�W���E���h�E�q���o,,1003,�c���s�r�K���{�e35-1,,34.60658259,137.1786724,,,,,,,,,,,,�����E�L��,
232319,0030215054,���m��,�c���s,�ጩ�_���L��,���J�~�m�E�\���q���o,,1003,�c���s�ጩ���ѓ���56,,34.60388561,137.1680303,,,,,,,,,,�i������,,�����E�L��,
232319,0030215055,���m��,�c���s,�z�ˉ^���L��,�R�V�h�E���h�E�R�E�G��,,1003,�c���s�z�˒��{��760,,34.59458308,137.1499488,,,,,,,,,,,,�����E�L��,
232319,0030215056,���m��,�c���s,�����^������,�A�c�~�E���h�E�R�E�G��,,1003,�c���s�����Ò���R1,,34.60297028,137.0900786,,,,,,,,,,,,�����E�L��,
232319,0030215057,���m��,�c���s,�����̐X,�A�c�~�m����,,1003,�c���s�����Ò���R30-1�O,,34.59965084,137.0894006,,,,,,,,,,,,�����E�L��,
232319,0030215058,���m��,�c���s,�T�R�_���L��,�J�����}�m�E�\���q���o,,1003,�c���s�T�R����n70,,34.61022747,137.0672543,,,,,,,,,,�i�������A�K�i����,,�����E�L��,
232319,0030215059,���m��,�c���s,���m�l�C�l�̐X,�j�V�m�n�}�J�C�q���m����,,1003,�c���s���R����1-18,,34.61414887,137.039682,,,,,,,,,,,,�����E�L��,
232319,0030215060,���m��,�c���s,�����r����,�n�b�^�`�C�P�R�E�G��,,1003,�c���s�x�ؒ��a���R2-98,,34.59553069,137.0611336,,,,,,,,,,�D�撓�ԏ�L��A�i������,,�����E�L��,
232319,0030215061,���m��,�c���s,�[�z���l������,���E�q�K�n�}�q�K�V�R�E�G��,,1003,�c���s�[�z���l29,,34.64341557,137.139355,,,,,,,,,,,,�����E�L��,
232319,0030215062,���m��,�c���s,�[�z���l������,���E�q�K�n�}�j�V�R�E�G��,,1003,�c���s�[�z���l156,,34.64136367,137.1376694,,,,,,,,,,,,�����E�L��,
232319,0030215063,���m��,�c���s,��v�ی���,�I�I�N�{�R�E�G��,,1003,�c���s��v�ے�����202-15�O,,34.65122,137.23999,,,,,,,,,,�D�撓�ԏ�L��,,�����E�L��,
232319,0030215064,���m��,�c���s,���]����,�t�N�G�R�E�G��,,1003,�c���s���]������������1-1�O,,34.62726,137.10388,,,,,,,,,,���ړI�g�C���L��,,�����E�L��,
232319,0030215065,���m��,�c���s,�Y�ЂP������,�E���J�^�C�`�S�E�R�E�G��,,1003,�c���s�Еl����ː���40�O,,34.69478,137.26472,,,,,,,,,,,,�����E�L��,
232319,0030215066,���m��,�c���s,�Y�ЂQ������,�E���J�^�j�S�E�R�E�G��,�܂��܌���,1003,�c���s�Y���匴��58-1�O,,34.69973,137.2697,,,,,,,,,,,,�����E�L��,
232319,0030215067,���m��,�c���s,�Y�ЂR������,�E���J�^�T���S�E�R�E�G��,,1003,�c���s�Y������1�O,,34.6951,137.26645,,,,,,,,,,,,�����E�L��,
232319,0030215068,���m��,�c���s,�Y�ЂS������,�E���J�^�����S�E�R�E�G��,,1003,�c���s�Y���k����55-2�O,,34.69581,137.26631,,,,,,,,,,,,�����E�L��,
232319,0030215069,���m��,�c���s,�܂��Ȃ��L��,�}�`�i�J�q���o,,1003,�c���s�c��������l13-1�O,,34.68653,137.26697,,,,,,,,,,���ړI�g�C���L��,,�����E�L��,
232319,0030215070,���m��,�c���s,�}�R�_������,�J�T���}�m�E�\���R�E�G��,,1003,�c���s�Y���}�R11-1,,34.705658,137.277927,,,,,,,,,,�i�������A�肷��L��,,�����E�L��,
232319,0030215071,���m��,�c���s,�������r���R����,�J�W�^�C�P�T�g���}�R�E�G��,,1003,�c���s�c��������74-2,,34.67419114,137.250423,,,,,,,,,,�D�撓�ԏ�L��A���ړI�g�C���L��A�i������,,�����E�L��,
232319,0030215072,���m��,�c���s,��R�r���ӌ���,�~���}�C�P�~�Y�x�R�E�G��,,1003,�c���s�Y���ĎR60-1,,34.694579,137.277851,,,,,,,,,,�i������,,�����E�L��,
