NO,����,����_�J�i,�Z��,����,�ܓx,�o�x,�W��,�d�b�ԍ�,�����ԍ�,�s�撬���R�[�h,�s���{����,�s�撬����,�ЊQ���_�^��,�ЊQ���_�R����A�y�Η��y�ђn����,�ЊQ���_����,�ЊQ���_�n�k,�ЊQ���_�Ôg,�ЊQ���_��K�͂ȉΎ�,�ЊQ���_�����×�,�ЊQ���_�ΎR����,�w����Ƃ̏d��,�z����e�l��,�ΏۂƂȂ钬��E������,URL,���l
1,�V��L���ٍ����w�Z,�V���V�����E�L���E�J���R�E�g�E�K�b�R�E,�����E���썇���n,,,,,,,232211,���m��,�V��s,1,1,,1,,1,1,,1,,,,
2,�V�钆�w�Z,�V���V���`���E�K�b�R�E,����ɏ�1,,,,,,,232211,���m��,�V��s,1,1,,1,,1,1,,1,,,,
3,�V�鏬�w�Z,�V���V���V���E�K�b�R�E,�������D76,,,,,,,232211,���m��,�V��s,1,1,,1,,1,1,,1,,,,
4,�x�i�_�ЍL��,�g�~�i�K�W���W���q���o,���{�m��78,,,,,,,232211,���m��,�V��s,,,,1,,1,,,,,,,
5,�����h���L��,�L���E�V���E�{�E�q���o,���R���v��11,,,,,,,232211,���m��,�V��s,,,,1,,1,,,,,,,
6,�ЎR�斯�L��,�J�^���}�N�~���q���o,�ЎR�������~178-2,,,,,,,232211,���m��,�V��s,,,,1,,1,,,,,,,
7,����斯�L��,�g�N�T�_�N�~���q���o,���莚�_�m�O564-5,,,,,,,232211,���m��,�V��s,,,,1,,1,,,,,,,
8,�R�����ٍL��,���}�R�E�~���J���q���o,�L�h������813-1,,,,,,,232211,���m��,�V��s,,,,1,,1,,,,,,,
9,�P�q�����ٍL��,�E�X�S�R�E�~���J���q���o,�L�h������1232,,,,,,,232211,���m��,�V��s,,,,1,,1,,,,,,,
10,���o�������ٍL��,�R���f�r���R�E�~���J���q���o,�L�h�����Y273-1,,,,,,,232211,���m��,�V��s,,,,1,,1,,,,,,,
11,�z�K�����ٍL��,�X���R�E�~���J���q���o,�L�h�������O226�E227��,,,,,,,232211,���m��,�V��s,,,,1,,1,,,,,,,
12,�狽���w�Z,�`�T�g�V���E�K�b�R�E,���R���O��4-1,,,,,,,232211,���m��,�V��s,1,1,,1,,1,1,,1,,,,
13,�狽���w�Z,�`�T�g�`���E�K�b�R�E,���R�����ڋL24,,,,,,,232211,���m��,�V��s,1,1,,1,,1,1,,1,,,,
14,����������,�Z�C�u�R�E�~���J��,���R�����ڋL24,,,,,,,232211,���m��,�V��s,1,1,,1,,1,1,,1,,,,
15,�狽�����ǂ���,�`�T�g�j�V�R�h���G��,�L�����n�n11-2,,,,,,,232211,���m��,�V��s,1,1,,1,,1,1,,1,,,,
16,��c������L��,�m�_�`���E�R���q�q���o,��؎�����75-1,,,,,,,232211,���m��,�V��s,,,,1,,1,,,,,,,
17,�s���k����,�C�`�o�_�C�L�^�R�E�G��,�s���1-10-9,,,,,,,232211,���m��,�V��s,,,,1,,1,,,,,,,
18,���s������ٍL��,�o�J�C�`�o�R�E�~���J���q���o,��c������36-1,,,,,,,232211,���m��,�V��s,,,,1,,1,,,,,,,
19,��،����ٍL��,�C�i�M�R�E�~���J���q���o,��؎��V����33�E34��,,,,,,,232211,���m��,�V��s,,,,1,,1,,,,,,,
20,�L���W�׏�L��,�g���V�}�V���E�J�W���E�q���o,�L�����O��7-1,,,,,,,232211,���m��,�V��s,,,,1,,1,,,,,,,
21,��c��������,�J���_�W�h�E�R�E�G��,��c���V��4-1,,,,,,,232211,���m��,�V��s,,,,1,,1,,,,,,,
22,��c���V���n,�J���_�o�����E�G���`,��c���{�{��104-1�E105-3��,,,,,,,232211,���m��,�V��s,,,,1,,1,,,,,,,
23,�狽�_�ЍL��,�`�T�g�W���W���q���o,��c����s��3,,,,,,,232211,���m��,�V��s,,,,1,,1,,,,,,,
24,���������w�Z,�g�E�S�E�j�V�V���E�K�b�R�E,���䎚����37-1,,,,,,,232211,���m��,�V��s,1,1,,1,,1,1,,1,,,,
25,�x������ٍL��,�g�~�U���R�E�~���J���q���o,�x�򎚈��y��262-4,,,,,,,232211,���m��,�V��s,,,,1,,1,,,,,,,
26,�������w�Z,�g�E�S�E�`���E�K�b�R�E,�|�L162-2,,,,,,,232211,���m��,�V��s,1,1,,1,,1,1,,1,,,,
27,��H�����ٍL��,�J���W�R�E�~���J���q���o,��H���A��25,,,,,,,232211,���m��,�V��s,,,,1,,1,,,,,,,
28,���q�����ٍL��,�E�V�O���R�E�~���J���q���o,���q���㕽55,,,,,,,232211,���m��,�V��s,,,,1,,1,,,,,,,
29,�{�������ٍL��,�X�i�K�R�E�~���J���q���o,�{�����Ί�32-1,,,,,,,232211,���m��,�V��s,,,,1,,1,,,,,,,
30,�V�鑍���������㋣�Z��,�V���V���\�E�S�E�R�E�G�����N�W���E�L���E�M�W���E,�o��E��J�E��C�n��,,,,,,,232211,���m��,�V��s,,,,1,,1,,,,,,,
31,��C�V���n,�I�I�~�����N�`�R�E�G��,��C������64-2�E64-14��,,,,,,,232211,���m��,�V��s,,,,1,,1,,,,,,,
32,�L�C�Βn����,�A���~�����N�`�R�E�G��,�L�C�����e�n��,,,,,,,232211,���m��,�V��s,,,,1,,1,,,,,,,
33,���������w�Z,�g�E�S�E�q�K�V�V���E�K�b�R�E,������402-2,,,,,,,232211,���m��,�V��s,1,1,,1,,1,1,,1,,,,
34,�M�����w�Z,�t�i�c�P�V���E�K�b�R�E,���g������13,,,,,,,232211,���m��,�V��s,1,1,,1,,1,1,,1,,,,
35,�g�������,���V�J���R�E�~���J��,�g�쎚���55-1,,,,,,,232211,���m��,�V��s,,,,1,,1,,,,,,,
36,���F���W���Z���^�[�L��,�i�J�E���V���E���N�Z���^�[�q���o,���F������44-23,,,,,,,232211,���m��,�V��s,,,,1,,1,,,,,,,
37,�x���ӂ邳�Ɖ�ٍL��,�g�~�I�J�t���T�g�J�C�J���q���o,�x��������8-2,,,,,,,232211,���m��,�V��s,,,,1,,1,,,,,,,
38,�������w�Z,���i�V���E�K�b�R�E,�x������ɖ�15-1,,,,,,,232211,���m��,�V��s,1,1,,1,,1,1,,1,,,,
39,�������w�Z,���i�`���E�K�b�R�E,�x����������3,,,,,,,232211,���m��,�V��s,1,1,,1,,1,1,,1,,,,
40,��쏬�w�Z,�j���m�V���E�K�b�R�E,��쎚���c33,,,,,,,232211,���m��,�V��s,1,1,,1,,1,1,,1,,,,
41,��L�c�����ٍL��,�q�g�N���_�R�E�~���J���q���o,��L�c�����41-2,,,,,,,232211,���m��,�V��s,,,,1,,1,,,,,,,
42,������W���Z���^�[�L��,���i�C�V���E���N�Z���^�[�q���o,�����䎚���㉮�~2-3,,,,,,,232211,���m��,�V��s,,,,1,,1,,,,,,,
43,�P�����w�Z,�z�E���C�`���E�K�b�R�E,��������1,,,,,,,232211,���m��,�V��s,1,1,1,1,,1,1,,1,,,,
44,�P���������w�Z,�z�E���C�`���E�u�V���E�K�b�R�E,�����|�c14,,,,,,,232211,���m��,�V��s,1,1,1,1,,1,1,,1,,,,
45,�P�������w�Z,�z�E���C�W�V���E�K�b�R�E,��V������I��1,,,,,,,232211,���m��,�V��s,1,1,1,1,,1,1,,1,,,,
46,��V���R�~���j�e�B�v���U,�N���[�R�~���j�e�B�v���U,��V������ɓ�12-3,,,,,,,232211,���m��,�V��s,1,1,1,1,,1,1,,1,,,,
47,���P�������w�Z,�L���E�z�E���C�j�V�V���E�K�b�R�E,�z������������50,,,,,,,232211,���m��,�V��s,1,1,1,1,,1,1,,1,,,,
48,�C�V�\�����P�Z���^�[,�G�r�R�E�]�E�J�C�[���Z���^�[,�C�V���猴�c5-1,,,,,,,232211,���m��,�V��s,1,1,1,1,,1,1,,1,,,,
49,���C�V���w�Z,�L���E�G�r�V���E�K�b�R�E,�C�V���{�O17,,,,,,,232211,���m��,�V��s,1,1,1,1,,1,1,,1,,,,
50,���A�J���w�Z,�L���E�����S�N�V���E�K�b�R�E,�l�J3-2,,,,,,,232211,���m��,�V��s,1,1,1,1,,1,1,,1,,,,
51,�����쏬�w�Z,�c�Q�K���V���E�K�b�R�E,���g�c���ܔ��c187-1,,,,,,,232211,���m��,�V��s,1,1,1,1,,1,1,,1,,,,
52,�R�g�c�g���[�j���O�Z���^�[,���}���V�_�g���[�j���O�Z���^�[,��g�c���R�{2-2,,,,,,,232211,���m��,�V��s,1,1,1,1,,1,1,,1,,,,
53,�������쏬�w�Z,�L���E�c�Q�m�V���E�K�b�R�E,�����쎚�r�c684-23,,,,,,,232211,���m��,�V��s,1,1,1,1,,1,1,,1,,,,
54,�P�������W�,�z�E���C�`���E�I�E�V���E�J�C�W��,��쎚�v����39-2,,,,,,,232211,���m��,�V��s,1,1,1,1,,1,1,,1,,,,
55,���z���w�Z,�g�E���E�V���E�K�b�R�E,��쎚����70,,,,,,,232211,���m��,�V��s,1,1,1,1,,1,1,,1,,,,
56,��������Ґ��������Z���^�[,�g�E�u�R�E���C�V���C�L�K�C�Z���^�[,�\�o��������32,,,,,,,232211,���m��,�V��s,1,1,1,1,,1,1,,1,,,,
57,������F�R�~���j�e�B�v���U,�i�i�T�g�C�b�V�L�R�~���j�e�B�v���U,������F�����L��26-2,,,,,,,232211,���m��,�V��s,1,1,1,1,,1,1,,1,,,,
58,�P�������w�Z,�z�E���C�q�K�V�V���E�K�b�R�E,�썇����75-1,,,,,,,232211,���m��,�V��s,1,1,1,1,,1,1,,1,,,,
59,���_���W�����ړI�������p�{��,�c�N�f�m�E�\���V���E���N�^���N�e�L�L���E�h�E�����E�V�Z�c,��萛�����ݾ�18,,,,,,,232211,���m��,�V��s,1,1,1,1,,1,1,,1,,,,
60,���J�����w�Z,�L���E�J�C�Z�C�V���E�K�b�R�E,���c�����p��3,,,,,,,232211,���m��,�V��s,1,1,1,1,,1,1,,1,,,,
61,�V��L���ٍ����w�Z���Z��,�V���V�����E�L���E�J���R�E�g�E�K�b�R�E�c�N�f�R�E�V��,��荂�����،ˌ�1-2,,,,,,,232211,���m��,�V��s,1,1,1,1,,1,1,,1,,,,
62,���b���w�Z,�L���E�g���G�V���E�K�b�R�E,��萴�x����ґ�9,,,,,,,232211,���m��,�V��s,1,1,1,1,,1,1,,1,,,,
63,���_�������P�Z���^�[,�c�N�f�m�E�\���J���L���E�J�C�[���Z���^�[,��荂�����`��9-7,,,,,,,232211,���m��,�V��s,1,1,1,1,,1,1,,1,,,,
64,���Ō𗬊�,�c�N�f�R�E�����E�J��,��荂��������28-1,,,,,,,232211,���m��,�V��s,1,1,1,1,,1,1,,1,,,,
,��菬�w�Z,�c�N�f�V���E�K�b�R�E,��荂��������32,,,,,,,,,,,,,,,,,,,,,,
