NO,�ҏW�X�e�[�^�X,�o�^����,�ύX����,�s�撬���R�[�h,�s���{����,�s�撬����,����,����_�J�i,���,�Z��,����,�ܓx,�o�x,�A�N�Z�X���@,���ԏ���,�d�b�ԍ�,FAX�ԍ�,�@�l�ԍ�,�c�̖�,�F���N����,���e���,����N��,���p�\�j��,�J�n����,�I������,���p�\�������L����,�ꎞ�a����̗L��,URL,�I���c�ւ�_�����Ή��L��,�I���c�ւ�_�j���Ή��L��,�I���c�ւ�_���l,����_�����Ή��L��,����_�j���Ή��L��,����_���l,�~���N����_�����Ή��L��,�~���N����_�j���Ή��L��,�~���N����_���l,�g�C���q�A��_�����Ή��L��,�g�C���q�A��_�j���Ή��L��,�g�C���q�A��_���l,���l,�I�[�v���f�[�^�Ƃ��Ă̌��J�̏���,�S���ҏ���,�S���Ҏ���,�S���ғd�b,�S����FAX,�S���҃��[��,�ύX����,���o�C��_�Y�[��,�X�|�b�g�s���摜,�񋟃T�[�r�X(�L���v�V����),�񋟃T�[�r�X(�ʐ^),�J�e�S��
1,���J,2020/4/1,2020/4/1,232017,���m��,�L���s,���������Z���^�[,�g�E�u�}�h�O�`�Z���^�[,�s�����E�����Z���^�[,���m���L���s����c1-12-2,,34.757598,137.426803,,,0532-63-1144,,,,,,,���ΐ��؋�,8:30,17:15,�y�j�A���j�A�j���E�x���A�N���N�n�͂��x�݁B,��,,�L,�L,�\���o�ɂ��A�܂肽���ݎ����ނ�����̒񋟁B,��,��,,��,��,,��,��,,,,,,,,,,,OMUTSU_ONLY,,https://mi.temirin.jp/data/contentset/tmp//D/3D/assets/spot/jKZP4F.png,�s�����E�����Z���^�[
2,���J,2020/4/1,2020/4/1,232017,���m��,�L���s,�L���s����,�g���n�V�V���N�V��,�s�����E�����Z���^�[,���m���L���s������1,,34.769116,137.392017,,,0532-51-2111,,,,,,,���ΐ��؋�,8:30,17:15,�y���j���A�N���N�n�͂��x�݁B,��,,�L,�L,1�K�������A�g��҃g�C���A2�K���ǂ��ƒ�ہA13�K�����g�C�����B,�L,��,1�K�������B,��,��,,�L,�L,�x�r�[�L�[�v��1�K�g��҃g�C���B�q�A��g�C���͐���1�K�A4�K�A8�K�g��҃g�C���A���� B1�K�A1�`4�K�A7�K�A13�K�g��҃g�C���B,,,,,,,,,,OMUTSU_MILK_TOILET,,https://mi.temirin.jp/data/contentset/tmp//D/3D/assets/spot/F8AbV0.png,�s�����E�����Z���^�[
3,���J,2020/4/1,2020/4/1,232017,���m��,�L���s,�암�����Z���^�[,�i���u�}�h�O�`�Z���^�[,�s�����E�����Z���^�[,���m���L���s�x�{�������B67,,34.742052,137.385161,,,0532-48-3011,,,,,,,���ΐ��؋�,8:30,17:15,�y���j���A�N���N�n�͂��x�݁B,��,,�L,�L,1�K�������B,�L,��,1�K�������B�g�p�̍ۂ͐E���֐��������Ă��������B,��,��,,��,��,,,,,,,,,,,OMUTSU_MILK_HOTWATER,,https://mi.temirin.jp/data/material/omutsu_milk.png,�s�����E�����Z���^�[
4,���J,2020/4/1,2020/4/1,232017,���m��,�L���s,��ʎ�����,�R�E�c�E�W�h�E�J��,�q�ǂ�,���m���L���s���R�����r��35,,34.753687,137.402635,,,0532-61-5818,,,,,,,�ΐ��؋��y��,9:00,16:30,���T���j���i�j���̏ꍇ�͗����j�A�N���N�n�͂��x�݁B,��,,�L,�L,1�K�g��҃g�C���B,�L,��,1�K�������j�����g�p�����ۂ͐E���ɂ����������������B,��,��,,�L,�L,1�K�g��҃g�C���B,�ǂ��̍L��i�΁E���E��9��30���`12��30���j�ق��A�e�q�����e�틳�������{�B,,,,,,,,,OMUTSU_MILK_TOILET,,https://mi.temirin.jp/data/contentset/tmp//D/3D/assets/spot/bfhDgH.png,�q�ǂ�
5,���J,2020/4/1,2020/4/1,232017,���m��,�L���s,���ǂ������فi�W���v���U�j,�R�h���~���C�J���i�c�h�C�v���U�j,�q�ǂ�,���m���L���s���t��3-1,,34.768716,137.383665,,,0532-21-5525,,,,,,,���Ζ؋��y��,9:30,21:00,���j���i�j�E�x���̏ꍇ�͗����j�A�N���N�n�͂��x�݁B,��,,�L,�L,1�K�B,�L,��,1�K�q��ăv���U�A2�K���C���ׁB,��,��,,�L,�L,,,,,,,,,,,OMUTSU_MILK_TOILET,,https://mi.temirin.jp/data/contentset/tmp//D/3D/assets/spot/WwgwN2.png,�q�ǂ�
6,���J,2020/4/1,2020/4/1,232017,���m��,�L���s,���ǂ������فi�̌��E�����v���U�j,�R�h���~���C�J���i�^�C�P���E�n�b�P���v���U�j,�q�ǂ�,���m���L���s���t��3-1,,34.768636,137.383666,,,0532-21-5525,,,,,,,���Ζ؋��y��,9:30,17:00,7�`8����18:00�܂ŁB���j���i�j�E�x���̏ꍇ�͗����j�A�N���N�n�͂��x�݁B,��,,�L,�L,1�K�B,��,��,,��,��,,�L,�L,1�K�q��ăv���U�A2�K���C���ׁB,,,,,,,,,,OMUTSU_TOILET,,https://mi.temirin.jp/data/contentset/tmp//D/3D/assets/spot/cY9ayo.png,�q�ǂ�
7,���J,2020/4/1,2020/4/1,232017,���m��,�L���s,���ǂ������فi�q��ăv���U�j,�R�h���~���C�J���i�R�\�_�e�v���U�j,�q�ǂ�,���m���L���s���t��3-1,,34.768549,137.383667,,,0532-21-5525,,,,,,,���Ζ؋��y��,9:30,17:00,���j���i�j�E�x���̏ꍇ�͗����j�A�N���N�n�͂��x�݁B,��,,�L,�L,1�K�B,�L,��,1�K�q��ăv���U�A2�K���C���ׁB,�L,�L,1�K�q��ăv���U�J�E���^�[�֐��������Ă��������B,�L,�L,,�q��ăv���U�ł́A�e�q�u���A�N��ʌ𗬉�A�玙���k�A�����i�y���j�̂݁j�����{�B,,,,,,,,,OMUTSU_MILK_HOTWATER_TOILET,,https://mi.temirin.jp/data/contentset/tmp//D/3D/assets/spot/gkECvK.png,�q�ǂ�
8,���J,2020/4/1,2020/4/1,232017,���m��,�L���s,���ǂ���ґ������k�x���Z���^�[,�R�h�����J���m�\�E�S�E�\�E�_���V�G���Z���^�[,�q�ǂ�,���m���L���s���t��3-1,,34.768822,137.384286,,,0532-54-7830,,,,,,,���Ζ؋��y��,9:00,19:00,�y�A���j���́A9:00����17:00�܂ŁB�j�x���A�N���N�n�͂��x�݁B,��,,�L,�L,1�K���ړI�g�C��,�L,��,,��,��,,�L,�L,1�K���ړI�g�C��,�q��ĂɊւ��鑊�k�𐏎��󂯕t���Ă��܂�,,,,,,,,,OMUTSU_MILK_TOILET,,https://mi.temirin.jp/data/contentset/tmp//D/3D/assets/spot/q0EMG6.png,�q�ǂ�
9,���J,2020/4/1,2020/4/1,232017,���m��,�L���s,�������A�������̂�ق��p�[�N,�\�E�S�E�h�E�V���N�u�c�R�E�G���m���z�C�p�[�N,����,���m���L���s��⒬���匊1-238,,34.721273,137.432393,,,0532-41-2186,,,,,,,�ΐ��؋��y��,9:00,16:30,���T���j���i�j���̏ꍇ�͗����j�A�N���N�n�͂��x�݁B,��,,�L,�L,�����ɐ��ӏ�����B�̂�ق��p�[�N�}�b�v�ɂĈē������Ă��܂��B,�L,��,�����ɐ��ӏ�����B�̂�ق��p�[�N�}�b�v�ɂĈē������Ă��܂��B,�L,�L,�Ǘ��������ɂ����������������B(�A���A���y�̓������������j,�L,�L,�����ɐ��ӏ�����B�̂�ق��p�[�N�}�b�v�ɂĈē������Ă��܂��B,,,,,,,,,,OMUTSU_MILK_HOTWATER_TOILET,,https://mi.temirin.jp/data/contentset/tmp//D/3D/assets/spot/xvN74s.png,����
10,���J,2020/4/1,2020/4/1,232017,���m��,�L���s,�吴���n�敟���Z���^�[,�I�I�V�~�Y�`�C�L�t�N�V�Z���^�[,�����E�ی�,���m���L���s�吴�������吴��546,,34.69766,137.363328,,,0532-25-6141,,,,,,,�ΐ��؋��y��,9:00,17:00,���T���j���i���j���j���̏ꍇ�͗����j�A�N���N�n�͂��x�݁B,��,,�L,�L,�\���o�ɂ��A�܂肽���ݎ����ނ�����̒񋟁B,��,��,,��,��,,��,��,,,,,,,,,,,OMUTSU_ONLY,,https://mi.temirin.jp/data/contentset/tmp//D/3D/assets/spot/hOuvGP.png,�����E�ی�
11,���J,2020/4/1,2020/4/1,232017,���m��,�L���s,��Q�ҕ�����ق�����s�A,�V���E�K�C�V���t�N�V�J�C�J���T�N���s�A,�����E�ی�,���m���L���s���V��15,,34.762986,137.404886,,,0532-53-3153,,,,,,,�ΐ��؋��y��,9:00,21:00,���T���j���A�j���A�N���N�n�͂��x�݁B,��,,�L,�L,1�K�݂�Ȃ̃g�C���B,�L,��,�����X�y�[�X�i�a���j�͒c�̗��p���Ŏg�p�ł��Ȃ��ꍇ������܂��B,�L,�L,�������ɂ����������������B,�L,�L,1�K�݂�Ȃ̃g�C���B,,,,,,,,,,OMUTSU_MILK_HOTWATER_TOILET,,https://mi.temirin.jp/data/contentset/tmp//D/3D/assets/spot/a7TQvc.png,�����E�ی�
12,���J,2020/4/1,2020/4/1,232017,���m��,�L���s,���������Z���^�[�����g�s�A,�\�E�S�E�t�N�Z�C�Z���^�[�A�C�g�s�A,�����E�ی�,���m���L���s�O����115,,34.765341,137.406335,,,0532-57-6800,,,,,,,�ΐ��؋��y��,9:00,21:00,���T���j���i�j���̏ꍇ�͗����j�A�N���N�n�͂��x�݁B,��,,�L,�L,3�K�������A3�K���ړI�g�C���B,�L,��,3�K�������B,�L,�L,�ǂ��̍L����{���̓t�@�~���[��T�|�[�g��Z���^�[�ցB�܂��e�K�ɋ�����������܂��B,�L,�L,3�K���ړI�g�C���A�e�K�j���g�C��,3�K�Ƀt�@�~���[��T�|�[�g��Z���^�[�A����������܂��B�ǂ��̍L��́A���j���k10�`15���l���J�ÁB,,,,,,,,,OMUTSU_MILK_HOTWATER_TOILET,,https://mi.temirin.jp/data/contentset/tmp//D/3D/assets/spot/ociWyz.png,�����E�ی�
13,���J,2020/4/1,2020/4/1,232017,���m��,�L���s,�����V�l�z�[������,�\�E�S�E���E�W���z�[���c�c�W�\�E,�����E�ی�,���m���L���s�ё��������R11-65,,34.746496,137.436551,,,0532-61-2013,,,,,,,���ΐ��؋�,8:30,17:15,�y���j���A�N���N�n�͂��x�݁B,��,,�L,�L,�󎺂�񋟂ł��܂��B�������֐��������Ă��������B,�L,��,�󎺂�񋟂ł��܂��B�������֐��������Ă��������B,�L,�L,������񋟂ł��܂��B�������֐��������Ă��������B,��,��,,,,,,,,,,,OMUTSU_MILK_HOTWATER,,https://mi.temirin.jp/data/contentset/tmp//D/3D/assets/spot/EckkRW.png,�����E�ی�
14,���J,2020/4/1,2020/4/1,232017,���m��,�L���s,�����u�n�敟���Z���^�[,�c�c�W�K�I�J�`�C�L�t�N�V�Z���^�[,�����E�ی�,���m���L���s�����ܒ���22-16,,34.742936,137.405331,,,0532-64-4510,,,,,,,�ΐ��؋��y��,9:00,17:00,���T���j���i���j���j���̏ꍇ�͗����j�A�N���N�n�͂��x�݁B,��,,�L,�L,�\���o�ɂ��A�܂肽���ݎ����ނ�����̒񋟁B,��,��,,��,��,,��,��,,,,,,,,,,,OMUTSU_ONLY,,https://mi.temirin.jp/data/contentset/tmp//D/3D/assets/spot/fbGank.png,�����E�ی�
15,���J,2020/4/1,2020/4/1,232017,���m��,�L���s,�L���Ђ�������@,�g���n�V�q�J���j���E�W�C��,�����E�ی�,���m���L���s���t�����k��1-104,,34.741354,137.412372,,,0532-62-0019,,,,,,,���ΐ��؋��y��,9:00,16:00,�N���N�n�͂��x�݁B,��,,�L,�L,�����Ǘ��s���A�����p�Ǝ{�݊J���ɐ���������ꍇ������܂��B,�L,��,�����Ǘ��s���A�����p�Ǝ{�݊J���ɐ���������ꍇ������܂��B,�L,�L,�����Ǘ��s���A�����p�Ǝ{�݊J���ɐ���������ꍇ������܂��B,��,��,,,,,,,,,,,OMUTSU_MILK_HOTWATER,,https://mi.temirin.jp/data/contentset/tmp//D/3D/assets/spot/AiJ35H.png,�����E�ی�
16,���J,2020/4/1,2020/4/1,232017,���m��,�L���s,�ی����E�ی��Z���^�[�ق�����,�z�P���W���E�z�P���Z���^�[�z�C�b�v,�����E�ی�,���m���L���s���쒬������100,,34.733184,137.371232,,,0532-39-9111,,,,,,,���ΐ��؋�,8:30,17:15,�y���j���A�N���N�n�͂��x�݁B,��,,�L,�L,1�K�g�C���O�A2�K���ړIĲځi���ł����p�j�B2�K���f�G���A�������p�������ꍇ�́A1�K���ǂ��ی��ۂɐ��������Ă��������B,�L,��,2�K���f�G���A�������p�������ꍇ�́A1�K���ǂ��ی��ۂɐ��������Ă��������B,��,��,,�L,�L,1�K���ړI�g�C���A�����g�C���i���ł����p�j�B2�K���f�G���A�������p�������ꍇ�́A1�K���ǂ��ی��ۂɐ��������Ă��������B,���f���͎��R�ɂ����p���������܂��B,,,,,,,,,OMUTSU_MILK_TOILET,,https://mi.temirin.jp/data/contentset/tmp//D/3D/assets/spot/GnRH15.png,�����E�ی�
17,���J,2020/4/1,2020/4/1,232017,���m��,�L���s,���C�n�敟���Z���^�[,�����`�C�L�t�N�V�Z���^�[,�����E�ی�,���m���L���s���C�������c22�|2,,34.761207,137.356056,,,0532-31-8885,,,,,,,�ΐ��؋��y��,9:00,21:00,���T���j���i�j���̏ꍇ�͗����j�A�N���N�n�͂��x�݁B,��,,�L,�L,1�K���ړI�g�C���B,�L,��,1�K�������B,��,��,,�L,�L,1�K���ړI�g�C���B,�q���p�g�C��������܂��B,,,,,,,,,OMUTSU_MILK_TOILET,,https://mi.temirin.jp/data/contentset/tmp//D/3D/assets/spot/TGrOau.png,�����E�ی�
18,���J,2020/4/1,2020/4/1,232017,���m��,�L���s,�A�N�A���[�i�L��,�A�N�A���[�i�g���n�V,�X�|�[�c�E���N,���m���L���s�_��V�c�������m��1-3,,34.758517,137.323391,,,0532-31-4781,,,,,,,�ΐ��؋��y��,9:00,21:00,���T���j���i�j���̏ꍇ�͗����j�A1��1���͂��x�݁B,��,,�L,�L,1�K�g��҃g�C���B,�L,��,�󎺒񋟂ł��܂��B�������֐��������Ă��������B,�L,�L,�����ݔ��񋟂ł��܂��B�������֐��������Ă��������B,�L,�L,1�K�g��҃g�C���B,,,,,,,,,,OMUTSU_MILK_HOTWATER_TOILET,,https://mi.temirin.jp/data/contentset/tmp//D/3D/assets/spot/8MGjzS.png,�X�|�[�c�E���N
19,���J,2020/4/1,2020/4/1,232017,���m��,�L���s,�����̈��,�\�E�S�E�^�C�C�N�J��,�X�|�[�c�E���N,���m���L���s�_��V�c�������m��1-3,,34.758076,137.324947,,,0532-31-4781,,,,,,,�ΐ��؋��y��,9:00,21:00,���T���j���i�j���̏ꍇ�͗����j�A�N���N�n�͂��x�݁B,��,,�L,��,�����p�X�ߎ���񋟂ł��܂��B�������֐��������Ă��������B,�L,��,�����p�X�ߎ���񋟂ł��܂��B�������֐��������Ă��������B,�L,�L,������񋟂ł��܂��B�������֐��������Ă��������B,�L,�L,1�K�A2�K�̐g��җp�g�C���B,,,,,,,,,,OMUTSU_MILK_HOTWATER_TOILET,,https://mi.temirin.jp/data/contentset/tmp//D/3D/assets/spot/hOBTah.png,�X�|�[�c�E���N
20,���J,2020/4/1,2020/4/1,232017,���m��,�L���s,�肷�ϖL��,���X�p�g���n�V,�X�|�[�c�E���N,���m���L���s������������n��10,,34.697777,137.418885,,,0532-38-5151,,,,,,,�ΐ��؋��y��,10:00,21:00,���T���j���i�j���̏ꍇ�͗����j�A�N���N�n�A���̑��{�ݓ_�����͂��x�݁B,��,,�L,�L,�e�K���ړI�g�C���B,�L,��,��t�\�o�ɂ��A���ړI�X�ߎ���񋟂ł��܂��B��t�ɐ��������Ă��������B,��,��,,�L,�L,�x�r�[�L�[�v�͊e�K�����g�C���B�q�A��͊e�K���ړI�g�C���B,�Ԃ����̉w�ȊO�̎{�݁i�v�[���A����A�g���[�j���O���[���j�ɂ��āA����I���c�𒅗p���Ă�����̂����p�͂ł��܂���B,,,,,,,,,OMUTSU_MILK_TOILET,,https://mi.temirin.jp/data/contentset/tmp//D/3D/assets/spot/nkZ00F.png,�X�|�[�c�E���N
21,���J,2020/4/1,2020/4/1,232017,���m��,�L���s,�A�C�v���U�L��,�A�C�v���U�g���n�V,����E�����E���̑��i�s���وȊO�j,���m���L���s���Ԓ������R143-6,,34.732573,137.381214,,,0532-46-7181,,,,,,,���ΐ��؋��y��,9:00,22:00,������R���j���i�j���̏ꍇ�͗������j�A�N���N�n�i12��29���`1��1���j�͂��x�݁B,��,,�L,�L,1�K���ړI�g�C���B,�L,��,1�K�������B�i�����̂݁B�j�������ނւ�������B�ۂ́A1�K���ړI�g�C���ցj,�L,�L,�������ւ����������������B,�L,�L,1�K���ړI�g�C���B,�}���ق�����A�G�{����������܂��B,,,,,,,,,OMUTSU_MILK_HOTWATER_TOILET,,https://mi.temirin.jp/data/contentset/tmp//D/3D/assets/spot/ggCP44.png,����E�����E���̑��i�s���وȊO�j
22,���J,2020/4/1,2020/4/1,232017,���m��,�L���s,�吴���܂Ȃь𗬊فu�~�i�N���v,�I�I�V�~�Y�}�i�r�R�E�����E�J���u�~�i�N���v,����E�����E���̑��i�s���وȊO�j,���m���L���s�吴�������F��10-7,,34.700552,137.36204,,,0532-25-5106,,,,,,,���ΐ��؋��y��,9:00,17:15,�J�ٓ��̏ڍׁi��8�F30�`17�F15�A��-��8�F30�`21�F00(���j����9�F00�`)�A�y��9�F00�`21�F00�j�B���j�����j���̏ꍇ�ƔN���N�n�͂��x�݁B,��,,�L,�L,���ނ����䂠��B,�L,��,�������B,�L,�L,�������ɐ��������Ă��������B,�L,�L,,�v���C���[���L�B,,,,,,,,,OMUTSU_MILK_HOTWATER_TOILET,,https://mi.temirin.jp/data/contentset/tmp//D/3D/assets/spot/YR8qlu.png,����E�����E���̑��i�s���وȊO�j
23,���J,2020/4/1,2020/4/1,232017,���m��,�L���s,�J���I���r��,�J���I���r��,����E�����E���̑��i�s���وȊO�j,���m���L���s���t��2-63,,34.766592,137.384902,,,0532-56-5141,,,,,,,�ΐ��؋��y��,9:00,21:00,���T���j���i�j�E�x�����܂ށj�A�N���N�n�͂��x�݁B,��,,�L,�L,1�K���ړI�g�C���ɏ�݁B,��,��,,��,��,,��,��,,,,,,,,,,,OMUTSU_ONLY,,https://mi.temirin.jp/data/contentset/tmp//D/3D/assets/spot/3w1cPT.png,����E�����E���̑��i�s���وȊO�j
24,���J,2020/4/1,2020/4/1,232017,���m��,�L���s,���R�j������,�V�[���V�n�N�u�c�J��,����E�����E���̑��i�s���وȊO�j,���m���L���s��⒬���匊1-238,,34.721073,137.432396,,,0532-41-4747,,,,,,,�ΐ��؋��y��,9:00,16:30,���ق�16:00�܂ŁB���j���i���j�����j���E�U�֋x���̂Ƃ��́A���̗������j�A12��29���`1��1���͂��x�݁B,��,,�L,�L,���ނ�����̓g�C�����ɗL�B,�L,��,,��,��,,��,��,,,,,,,,,,,OMUTSU_MILK,,https://mi.temirin.jp/data/contentset/tmp//D/3D/assets/spot/A0kYwj.png,����E�����E���̑��i�s���وȊO�j
25,���J,2020/4/1,2020/4/1,232017,���m��,�L���s,���N�Z���^�[,�Z�C�V���E�l���Z���^�[,����E�����E���̑��i�s���وȊO�j,���m���L���s���C��������26,,34.749526,137.371871,,,0532-46-8925,,,,,,,�ΐ��؋��y��,9:00,22:00,���j���i�j�x���̏ꍇ�͂��̗������j�A�N���N�n�͂��x�݁B,��,,�L,�L,1�K���ړI�g�C���B,�L,��,1�K�������B,��,��,,�L,�L,�����g�C���B,1�K�V�Y���Ƀv���C�X�y�[�X����B,,,,,,,,,OMUTSU_MILK_TOILET,,https://mi.temirin.jp/data/contentset/tmp//D/3D/assets/spot/z35QrJ.png,����E�����E���̑��i�s���وȊO�j
26,���J,2020/4/1,2020/4/1,232017,���m��,�L���s,�j�������Q��Z���^�[�p����,�_���W���L���E�h�E�T���J�N�Z���^�[�p����,����E�����E���̑��i�s���وȊO�j,���m���L���s�_��ӓ���3-22,,34.732796,137.33437,,,0532-33-2800,,,,,,,���ΐ��؋��y��,9:00,21:00,������R���j���i�j���̏ꍇ�͂��̗����j�A�N���N�n�͂��x�݁B,��,,�L,��,�����g�C���B,�L,��,�󎺒񋟂ł��܂��B�������֐��������Ă��������B,�L,�L,�����ݔ��񋟂ł��܂��B�������֐��������Ă��������B,�L,��,�����g�C���B,���̕����g�p���ɑ������������p���������܂��i���O�\�񂪕K�v�j�B,,,,,,,,,OMUTSU_MILK_HOTWATER_TOILET,,https://mi.temirin.jp/data/contentset/tmp//D/3D/assets/spot/GpKeA9.png,����E�����E���̑��i�s���وȊO�j
27,���J,2020/4/1,2020/4/1,232017,���m��,�L���s,�����}����,�`���E�I�E�g�V���J��,����E�����E���̑��i�s���وȊO�j,���m���L���s�H���䒬48,,34.754017,137.376016,,,0532-31-3131,,,,,,,�ΐ��؋��y��,9:30,19:00,�������A�y���j����17:00�܂ŁB���T���j���i�j���̏ꍇ�͗����j�A������S���j���i�j���̏ꍇ�͖ؗj���j�A�N���N�n�A���ʐ������Ԃ͂��x�݁B,��,,�L,�L,1�K���������B,�L,��,1�K���������B,��,��,,�L,�L,1�K�g��҃g�C���B,�ٓ����p�̂��߂̃x�r�[�J�[�ݏo����i���֌���3��ݒu�j�B,,,,,,,,,OMUTSU_MILK_TOILET,,https://mi.temirin.jp/data/contentset/tmp//D/3D/assets/spot/xfYqVz.png,����E�����E���̑��i�s���وȊO�j
28,���J,2020/4/1,2020/4/1,232017,���m��,�L���s,���h�{�w������,�t�^�K���V���N�z���W���V�����E�J��,����E�����E���̑��i�s���وȊO�j,���m���L���s��쒬������65,,34.723272,137.449843,,,0532-41-8580,,,,,,,�ΐ��؋��y��,9:00,17:00,���ق�16:30�܂ŁB���T���j���i�j�E�x�����܂ށj�A�N���N�n�͂��x�݁B,��,,�L,�L,�\���o�ɂ��A�܂肽���ݎ����ނ�����̒񋟁B,��,��,,��,��,,��,��,,,,,,,,,,,OMUTSU_ONLY,,https://mi.temirin.jp/data/contentset/tmp//D/3D/assets/spot/kpoQt0.png,����E�����E���̑��i�s���وȊO�j
29,���J,2020/4/1,2020/4/1,232017,���m��,�L���s,��̍��Ƃ�͂��|�p����PLAT,�z�m�N�j�g���n�V�Q�C�W���c�Q�L�W���E�v���b�g,����E�����E���̑��i�s���وȊO�j,���m���L���s�����c����123,,34.760721,137.384084,,,0532-39-8810,,,,,,,���ΐ��؋��y��,9:00,22:00,������R���j���i�j���̏ꍇ�͗����j�A�N���N�n�i12/29�`1/1�j�A�{�ݐݔ��ێ�_���̓��͂��x�݁B,��,,�L,�L,1�K�A2�K���ړI�g�C���i��z�[���A�A�[�g�X�y�[�X�ɂ�����܂��j,�L,��,1�K�������B�g�p�̍ۂ͐E���֐��������Ă��������B,�L,�L,1�K�������B,�L,�L,�q�A��g�C���́A1�K�A2�K���ړI�g�C���i��z�[���A�A�[�g�X�y�[�X�ɂ�����܂��j�B,,,,,,,,,,OMUTSU_MILK_HOTWATER_TOILET,,https://mi.temirin.jp/data/contentset/tmp//D/3D/assets/spot/N99nfr.png,����E�����E���̑��i�s���وȊO�j
30,���J,2020/4/1,2020/4/1,232017,���m��,�L���s,�|�[�g�C���t�H���[�V�����Z���^�[�J�������A,�|�[�g�C���t�H���[�V�����Z���^�[�J�������A,����E�����E���̑��i�s���وȊO�j,���m���L���s�_��ӓ���3-29,,34.732221,137.329753,,,0532-34-3712,,,,,,,���ΐ��؋��y��,9:00,17:00,�W�]���͓y���j�Ɍ���4���`9���F�ߌ�8���܂�10���`3���F�ߌ�7���܂ŁB�N���N�n�i12/29�`1/3�j�͂��x�݁B,��,,�L,�L,1�K���ړI�g�C���B,��,��,,��,��,,�L,�L,�q�A��g�C���͂P�K���ړI�g�C���B,,,,,,,,,,OMUTSU_TOILET,,https://mi.temirin.jp/data/contentset/tmp//D/3D/assets/spot/VFvJdS.png,����E�����E���̑��i�s���وȊO�j
31,���J,2020/4/1,2020/4/1,232017,���m��,�L���s,���p������,�r�W���c�n�N�u�c�J��,����E�����E���̑��i�s���وȊO�j,���m���L���s������3-1,,34.769285,137.394824,,,0532-51-2882,,,,,,,�ΐ��؋��y��,9:00,17:00,�������j���A�N���N�n�͂��x�݁B,��,,�L,�L,1�K���ړI�g�C���B,�L,��,���������̋󎺂�񋟂ł��܂��B�������ɐ��������Ă��������B,�L,�L,���������̋󎺂�񋟂ł��܂��B�������ɐ��������Ă��������B,�L,�L,�q�A��g�C���͂P�K���ړI�g�C���B,,,,,,,,,,OMUTSU_MILK_HOTWATER_TOILET,,https://mi.temirin.jp/data/contentset/tmp//D/3D/assets/spot/yLYQoj.png,����E�����E���̑��i�s���وȊO�j
32,���J,2020/4/1,2020/4/1,232017,���m��,�L���s,�����o����Z���^�[,�V�`���E�J�N�L���E�C�N�Z���^�[,����E�����E���̑��i�s���وȊO�j,���m���L���s��⒬�Αō�19-16,,34.729444,137.431764,,,0532-41-3330,,,,,,,�ΐ��؋��y��,9:00,16:30,���T���j���i�j���̏ꍇ�͗����j�A�N���N�n�͂��x�݁B,��,,�L,�L,,�L,�L,1�K�������i�����ݔ�����j,�L,�L,,�L,�L,1�K���ړI�g�C��,,,,,,,,,,OMUTSU_MILK_HOTWATER_TOILET,,https://mi.temirin.jp/data/contentset/tmp//D/3D/assets/spot/eGQtNK.png,����E�����E���̑��i�s���وȊO�j
33,���J,2020/4/1,2020/4/1,232017,���m��,�L���s,�n��������,�`�J�V�Q���J��,����E�����E���̑��i�s���وȊO�j,���m���L���s��⒬�Αō�19-16,,34.729125,137.431387,,,0532-41-2833,,,,,,,�ΐ��؋��y��,9:00,16:30,���T���j���i�j���̏ꍇ�͗����j�A�N���N�n�͂��x�݁B,��,,�L,��,�����p�g�C���B,�L,��,,��,��,,�L,��,,,,,,,,,,,OMUTSU_MILK_TOILET,,https://mi.temirin.jp/data/contentset/tmp//D/3D/assets/spot/az0rqc.png,����E�����E���̑��i�s���وȊO�j
34,���J,2020/4/1,2020/4/1,232017,���m��,�L���s,���c�Z��s����,�A�Y�}�_�R�E�N�V�~���J��,�Z��s����,���m���L���s�m�A�ؒ�15,,34.770114,137.412598,,,0532-61-9822,,,,,,,���ΐ��؋��y��,9:00,22:00,�E���َ݊��Ԃ�13:00�`17�F00�ł��B�N���N�n�͂��x�݁B,��,,�L,�L,�\���o�ɂ��A�܂肽���ݎ����ނ�����̒񋟂��B,��,��,,��,��,,��,��,,�E���َ݊��Ԃ̂ݗ��p�ł��܂��B,,,,,,,,,OMUTSU_ONLY,,https://mi.temirin.jp/data/contentset/tmp//D/3D/assets/spot/NhUwgE.png,�Z��s����
35,���J,2020/4/1,2020/4/1,232017,���m��,�L���s,���t�Z��s����,�}�c�o�R�E�N�V�~���J��,�Z��s����,���m���L���s�勴��3-107,,34.767907,137.380723,,,0532-53-4794,,,,,,,���ΐ��؋��y��,9:00,22:00,�E���َ݊��Ԃ�13:00�`17�F00�ł��B�N���N�n�͂��x�݁B,��,,�L,�L,�\���o�ɂ��A�܂肽���ݎ����ނ�����̒񋟂��B,��,��,,��,��,,��,��,,�E���َ݊��Ԃ̂ݗ��p�ł��܂��B,,,,,,,,,OMUTSU_ONLY,,https://mi.temirin.jp/data/contentset/tmp//D/3D/assets/spot/jFc7i6.png,�Z��s����
36,���J,2020/4/1,2020/4/1,232017,���m��,�L���s,�Óc�Z��s����,�c�_�R�E�N�V�~���J��,�Z��s����,���m���L���s���{�꒬�{�O10-2,,34.780703,137.367121,,,0532-31-9644,,,,,,,���ΐ��؋��y��,9:00,22:00,�E���َ݊��Ԃ�13:00�`17�F00�ł��B�N���N�n�͂��x�݁B,��,,�L,�L,�\���o�ɂ��A�܂肽���ݎ����ނ�����̒񋟂��B,��,��,,��,��,,��,��,,�E���َ݊��Ԃ̂ݗ��p�ł��܂��B,,,,,,,,,OMUTSU_ONLY,,https://mi.temirin.jp/data/contentset/tmp//D/3D/assets/spot/5ps1xy.png,�Z��s����
37,���J,2020/4/1,2020/4/1,232017,���m��,�L���s,��ӍZ��s����,�C�\�x�R�E�N�V�~���J��,�Z��s����,���m���L���s��`�����ێR60,,34.72818,137.366362,,,0532-46-9440,,,,,,,���ΐ��؋��y��,9:00,22:00,�E���َ݊��Ԃ�13:00�`17�F00�ł��B�N���N�n�͂��x�݁B,��,,�L,�L,�\���o�ɂ��A�܂肽���ݎ����ނ�����̒񋟂��B,��,��,,��,��,,��,��,,�E���َ݊��Ԃ̂ݗ��p�ł��܂��B,,,,,,,,,OMUTSU_ONLY,,https://mi.temirin.jp/data/contentset/tmp//D/3D/assets/spot/zRe3Z0.png,�Z��s����
38,���J,2020/4/1,2020/4/1,232017,���m��,�L���s,���Z��s����,�I�I�T�L�R�E�N�V�~���J��,�Z��s����,���m���L���s��蒬���`�m��16,,34.717079,137.344264,,,0532-25-2045,,,,,,,���ΐ��؋��y��,9:00,22:00,�E���َ݊��Ԃ�13:00�`17�F00�ł��B�N���N�n�͂��x�݁B,��,,�L,�L,�\���o�ɂ��A�܂肽���ݎ����ނ�����̒񋟂��B,��,��,,��,��,,��,��,,�E���َ݊��Ԃ̂ݗ��p�ł��܂��B,,,,,,,,,OMUTSU_ONLY,,https://mi.temirin.jp/data/contentset/tmp//D/3D/assets/spot/v1OyEt.png,�Z��s����
39,���J,2020/4/1,2020/4/1,232017,���m��,�L���s,��u�Z��s����,�^�J�I�J�R�E�N�V�~���J��,�Z��s����,���m���L���s�������3-7-1,,34.772695,137.424153,,,0532-61-9821,,,,,,,���ΐ��؋��y��,9:00,22:00,�E���َ݊��Ԃ�13:00�`17�F00�ł��B�N���N�n�͂��x�݁B,��,,�L,�L,�\���o�ɂ��A�܂肽���ݎ����ނ�����̒񋟂��B,��,��,,��,��,,��,��,,�E���َ݊��Ԃ̂ݗ��p�ł��܂��B,,,,,,,,,OMUTSU_ONLY,,https://mi.temirin.jp/data/contentset/tmp//D/3D/assets/spot/6CiywW.png,�Z��s����
40,���J,2020/4/1,2020/4/1,232017,���m��,�L���s,�����Z��s����,�Q�W���E�R�E�N�V�~���J��,�Z��s����,���m���L���s���𓌒������Y61-3,,34.802539,137.415119,,,0532-88-1420,,,,,,,���ΐ��؋��y��,9:00,22:00,�E���َ݊��Ԃ�13:00�`17�F00�ł��B�N���N�n�͂��x�݁B,��,,�L,�L,�\���o�ɂ��A�܂肽���ݎ����ނ�����̒񋟂��B,��,��,,��,��,,��,��,,�E���َ݊��Ԃ̂ݗ��p�ł��܂��B,,,,,,,,,OMUTSU_ONLY,,https://mi.temirin.jp/data/contentset/tmp//D/3D/assets/spot/1hoECp.png,�Z��s����
41,���J,2020/4/1,2020/4/1,232017,���m��,�L���s,���čZ��s����,�^���R�E�N�V�~���J��,�Z��s����,���m���L���s���Ē���2-27-1,,34.761127,137.450757,,,0532-61-9823,,,,,,,���ΐ��؋��y��,9:00,22:00,�E���َ݊��Ԃ�13:00�`17�F00�ł��B�N���N�n�͂��x�݁B,��,,�L,�L,�\���o�ɂ��A�܂肽���ݎ����ނ�����̒񋟂��B,��,��,,��,��,,��,��,,�E���َ݊��Ԃ̂ݗ��p�ł��܂��B,,,,,,,,,OMUTSU_ONLY,,https://mi.temirin.jp/data/contentset/tmp//D/3D/assets/spot/ZIVvWS.png,�Z��s����
42,���J,2020/4/1,2020/4/1,232017,���m��,�L���s,���Z��s����,�A�T�q�R�E�N�V�~���J��,�Z��s����,���m���L���s�L���s��������535-2,,34.766998,137.404444,,,0532-53-4795,,,,,,,���ΐ��؋��y��,9:00,22:00,�E���َ݊��Ԃ�13:00�`17�F00�ł��B�N���N�n�͂��x�݁B,��,,�L,�L,�\���o�ɂ��A�܂肽���ݎ����ނ�����̒񋟂��B,��,��,,��,��,,��,��,,�E���َ݊��Ԃ̂ݗ��p�ł��܂��B,,,,,,,,,OMUTSU_ONLY,,https://mi.temirin.jp/data/contentset/tmp//D/3D/assets/spot/Bm9Jtm.png,�Z��s����
43,���J,2020/4/1,2020/4/1,232017,���m��,�L���s,�J��Z��s����,�^�j�K���R�E�N�V�~���J��,�Z��s����,���m���L���s�����������m�J1-11,,34.727828,137.479103,,,0532-41-4963,,,,,,,���ΐ��؋��y��,9:00,22:00,�E���َ݊��Ԃ�13:00�`17�F00�ł��B�N���N�n�͂��x�݁B,��,,�L,�L,�\���o�ɂ��A�܂肽���ݎ����ނ�����̒񋟂��B,��,��,,��,��,,��,��,,�E���َ݊��Ԃ̂ݗ��p�ł��܂��B,,,,,,,,,OMUTSU_ONLY,,https://mi.temirin.jp/data/contentset/tmp//D/3D/assets/spot/I0lCdQ.png,�Z��s����
44,���J,2020/4/1,2020/4/1,232017,���m��,�L���s,�ԓc�Z��s����,�n�i�_�R�E�N�V�~���J��,�Z��s����,���m���L���s���H�c��247,,34.760746,137.373905,,,0532-31-9612,,,,,,,���ΐ��؋��y��,9:00,22:00,�E���َ݊��Ԃ�13:00�`17�F00�ł��B�N���N�n�͂��x�݁B,��,,�L,�L,�\���o�ɂ��A�܂肽���ݎ����ނ�����̒񋟂��B,��,��,,��,��,,��,��,,�E���َ݊��Ԃ̂ݗ��p�ł��܂��B,,,,,,,,,OMUTSU_ONLY,,https://mi.temirin.jp/data/contentset/tmp//D/3D/assets/spot/yVizbk.png,�Z��s����
45,���J,2020/4/1,2020/4/1,232017,���m��,�L���s,���t�Z��s����,�^�J�V�R�E�N�V�~���J��,�Z��s����,���m���L���s��쒬���㌴99-10,,34.720272,137.392756,,,0532-45-9716,,,,,,,���ΐ��؋��y��,9:00,22:00,�E���َ݊��Ԃ�13:00�`17�F00�ł��B�N���N�n�͂��x�݁B,��,,�L,�L,�\���o�ɂ��A�܂肽���ݎ����ނ�����̒񋟂��B,��,��,,��,��,,��,��,,�E���َ݊��Ԃ̂ݗ��p�ł��܂��B,,,,,,,,,OMUTSU_ONLY,,https://mi.temirin.jp/data/contentset/tmp//D/3D/assets/spot/2NxknO.png,�Z��s����
46,���J,2020/4/1,2020/4/1,232017,���m��,�L���s,��ˍZ��s����,�m�����R�E�N�V�~���J��,�Z��s����,���m���L���s��˒����z�K149-1,,34.698334,137.387725,,,0532-25-2146,,,,,,,���ΐ��؋��y��,9:00,22:00,�E���َ݊��Ԃ�13:00�`17�F00�ł��B�N���N�n�͂��x�݁B,��,,�L,�L,�\���o�ɂ��A�܂肽���ݎ����ނ�����̒񋟂��B,��,��,,��,��,,��,��,,�E���َ݊��Ԃ̂ݗ��p�ł��܂��B,,,,,,,,,OMUTSU_ONLY,,https://mi.temirin.jp/data/contentset/tmp//D/3D/assets/spot/kQMDNi.png,�Z��s����
47,���J,2020/4/1,2020/4/1,232017,���m��,�L���s,�A�c�Z��s����,�E�G�^�R�E�N�V�~���J��,�Z��s����,���m���L���s�A�c�����r��63-1,,34.710832,137.367045,,,0532-25-2046,,,,,,,���ΐ��؋��y��,9:00,22:00,�E���َ݊��Ԃ�13:00�`17�F00�ł��B�N���N�n�͂��x�݁B,��,,�L,�L,�\���o�ɂ��A�܂肽���ݎ����ނ�����̒񋟂��B,��,��,,��,��,,��,��,,�E���َ݊��Ԃ̂ݗ��p�ł��܂��B,,,,,,,,,OMUTSU_ONLY,,https://mi.temirin.jp/data/contentset/tmp//D/3D/assets/spot/lbjxrN.png,�Z��s����
48,���J,2020/4/1,2020/4/1,232017,���m��,�L���s,����Z��s����,�E�V�J���R�E�N�V�~���J��,�Z��s����,���m���L���s���쒬������13-28,,34.779723,137.416617,,,0532-53-9533,,,,,,,���ΐ��؋��y��,9:00,22:00,�E���َ݊��Ԃ�13:00�`17�F00�ł��B�N���N�n�͂��x�݁B,��,,�L,�L,�\���o�ɂ��A�܂肽���ݎ����ނ�����̒񋟂��B,��,��,,��,��,,��,��,,�E���َ݊��Ԃ̂ݗ��p�ł��܂��B,,,,,,,,,OMUTSU_ONLY,,https://mi.temirin.jp/data/contentset/tmp//D/3D/assets/spot/URdLii.png,�Z��s����