code,large_category,small_category,name,kana,address,contact,tel,fax,business_hours1,business_hours2,business_hours3,business_hours4,business_hours5,business_hours6,holiday,holiday_other,room_num,checkin,checkout,average_budget,seat_num,url,price,access,parking,service,note,main_image,image_caption1,image_caption2,image_caption3,image_caption4,image_caption5,image1,image2,image3,image4,image5,lat,lon
1,�h���{��,�r�W�l�X�z�e��,�L���p�[�N�z�e��,�Ƃ�͂��ρ[���قĂ�,�L���s�ԓc���썕79-2,,0532-31-6430,,,,,,,,,,23,15:00,10:00,,,http://www.nande.com/parkhotel/goannai.htm,"�V���O��4,000�~�`�i�ŕʁj",�L���w����k��5��,�אڒ��ԏꂠ��,,�L���w�������k��3���B���H�͔��������ƕ]���B��c�E����E���h���֗��ł��B&lt;br&gt;&lt;ul&gt;&lt;li&gt;Wi-Fi&lt;br&gt;&lt;/li&gt;&lt;/ul&gt;,1_image.jpg,,,,,,,,,,,34.75949425,137.3830837
2,�h���{��,�r�W�l�X�z�e��,�L�S�^�[�~�i���z�e��,�Ƃ�Ă��[�݂Ȃ�قĂ�,�L���s�w�O��ʈ꒚��46-1,,0532-56-1100,,,,,,,,,,99,16:00,10:00,,,https://www.toyotetsu.net/,"�V���O��6,300�~�`�i�ŕʁj",�L���w����k��1��,��g���ԏꂠ��,,"�L���w��������k��1���̍D���n�B&lt;br&gt;��g���ԏ�́uJRF�L���w�O���ԏ�v��24���ԉc�ƁA���̒��ԏ�360����e�Ńz�e�����k��1���B&lt;br&gt;�w�O���ӂɂ̓R���r�j�E���H�X����������ƂĂ��֗��B&lt;br&gt;&lt;ul&gt;&lt;li&gt;Wi-Fi&lt;/li&gt;&lt;li&gt;���H�t�i��6�F30�`9�F00�܂Łj&lt;span style=&quot;color: rgb(0, 0, 0); font-family: &amp;quot;�q���M�m�p�S Pro W3&amp;quot;, &amp;quot;Hiragino Kaku Gothic Pro&amp;quot;, ���C���I, Meiryo, &amp;quot;�l�r �o�S�V�b�N&amp;quot;, sans-serif; font-size: 12.96px; font-style: normal; font-variant-ligatures: normal; font-variant-caps: normal; font-weight: 400; letter-spacing: normal; orphans: 2; text-align: left; text-indent: 0px; text-transform: none; white-space: normal; widows: 2; word-spacing: 0px; -webkit-text-stroke-width: 0px; background-color: rgb(255, 255, 255); text-decoration-style: initial; text-decoration-color: initial; display: inline !important; float: none;&quot;&gt;&lt;/span&gt;&lt;/li&gt;&lt;/ul&gt;",2_image.jpg,,,,,,,2_image2.jpg,2_image3.jpg,,,34.76258801,137.3833546
3,�h���{��,�r�W�l�X�z�e��,�L���O���[���z�e��,�Ƃ�͂�����[��قĂ�,�L���s�L���H�꒚��1,,0532-55-1155,,,,,,,,,,84,16:00,10:00,,,http://www.t-green.co.jp/index.html,"�ʏ�\���5,700�~�`�i�ō��j",�L���w����k��2��,�Ȃ��i�_�񒓎ԏꂠ��j,,�L���w�������ʁA�k��2���B&lt;br&gt;�����n�����ɂ��������Ă��܂��̂ŁA�J�V�ł��P�̐S�z�͂���܂���B&lt;br&gt;&lt;ul&gt;&lt;li&gt;Wi-Fi&lt;br&gt;&lt;/li&gt;&lt;/ul&gt;,3_image.jpg,,,,,,,,,,,34.76451384,137.3831749
4,�h���{��,�r�W�l�X�z�e��,�r�W�l�X�z�e���������Ɓ@�L���X,�т��˂��قĂ邨������@�Ƃ�͂��Ă�,�L���s���⒬34-1,,0532-47-1111,,,,,,,,,,53,16:00,10:00,,,http://www.toyohashi.com/top.html,"�V���O��4,050�~�`",�L���w����ԂłT��,����i35��j,,�L���w��������Ԃ�5���B&lt;br&gt;�r�W�l�X�A�X�|�[�c���h�A�����؍݂ɃI�X�X���B&lt;br&gt;�[�E���H�t�v���������[�Y�i�u���B&lt;br&gt;&lt;ul&gt;&lt;li&gt;Wi-Fi&lt;/li&gt;&lt;li&gt;�嗁��&lt;br&gt;&lt;/li&gt;&lt;/ul&gt;,4_image.jpeg,�V���O��,�c�C��,,,,4_image1.jpeg,4_image2.jpeg,,,,34.75002714,137.3771828
5,�h���{��,����,�单������,�����������傩��,�L���s���r���p�c1,,0532-45-3958,,,,,,,,,,19,15:00,10:00,,,,"1��2�H4,400�~�`�i�ŕʁj",�L���w����Ԃ�5�����������r�w���k��3��,����,,����42�N�̑n�ƈȗ��A�ƒ�I�Ȃ����ĂȂ��ł������Ɨ��������]���̗��فB&lt;br&gt;�����؍݂����S�ł��B&lt;br&gt;&lt;ul&gt;&lt;li&gt;�H���Ȃ�&lt;/li&gt;&lt;li&gt;P20��&lt;/li&gt;&lt;li&gt;Wi-Fi&lt;br&gt;&lt;/li&gt;&lt;/ul&gt;,5_image.jpg,,,,,,,,,,,34.75076763,137.3880753
8,�h���{��,����,���B���� ����,�����ۂ���傩��@�܂��,�L���s�����ʓ񒚖�46,,0532-52-5058,,,,,,,,,,10,16:00,10:00,,,http://www.matsuyone.com/,"�P���Q�H11,000�~�`�i�ŕʁj",�L���w����s�d�u�s�����O�v�d�≺�ԓk��2��,����,,�n��150�]�N�A�`���Ɗi���ɍʂ�ꂽ�����ĂȂ��B&lt;br&gt;�{�i���Η����ŁA�F�l���̂��z�������҂����Ă���܂��B&lt;br&gt;&lt;ul&gt;&lt;li&gt;P7��&lt;/li&gt;&lt;li&gt;�嗁��&lt;/li&gt;&lt;li&gt;���E�[�H�t&lt;br&gt;&lt;/li&gt;&lt;/ul&gt;,8_image.jpg,,,,,,,,,,,34.76691996,137.3913181
10,�h���{��,�V�e�B�z�e��,�����W�[���z�e���L��,��킶�[��قĂ�Ƃ�͂�,�L���s����141,,0532-48-3131,,,,,,,,,,379,14:00,12:00,,,http://www.loisir-toyohashi.com/index.php,"6,300�~�`",�L���w����ԂłP�O���L���w�������V���g���o�X����,����i138��j,��^�o�X�o�L��,&lt;p&gt;&lt;strong&gt;�L���̃����h�}�[�N�z�e��&lt;/strong&gt;&lt;/p&gt;&lt;p&gt;&lt;strong&gt;&lt;/strong&gt;&lt;font size=&quot;2&quot;&gt;���Ɛ����o��X�A�����Ƒ��̂قڒ����Ɉʒu���鈤�m���̒��j�s�s �u�L���v �́A&lt;/font&gt;&lt;font size=&quot;2&quot;&gt;&lt;br&gt;&lt;font size=&quot;2&quot;&gt;�����₩�ȎO�͘p�Ɛ����E�L��A�Ί��R�̖L���Ȏ��R�Ɍb�܂ꂽ�ό����_�Ƃ��āA�܂��A&lt;br&gt;���{�L���̎����ԗA�o���`�ł���L���`�𒆐S�Ƃ������ۓI�ȎY�Ƌ��_�Ƃ��āA&lt;br&gt;����ւ̔��𑱂��Ă��܂��B�����W�[���z�e���L���́A�n��30�K�A����120m��&lt;br&gt;�L���̃����h�}�[�N�z�e���B�r�W�l�X��ό��ɁA��Ƃ肠��q���Ə[�������ݔ���&lt;br&gt;���������Ƃ��߂������������B&lt;/font&gt;&lt;/font&gt;&lt;/p&gt;&lt;font size=&quot;2&quot;&gt;&lt;p&gt;&lt;font size=&quot;2&quot;&gt;&lt;br&gt;�����W�[���z�e���L���Ȃ�ł͂́A���ߍׂ₩�Ȃ����ĂȂ��̐S�ł��q�l�����}���������܂��B&lt;/font&gt;&lt;/p&gt;&lt;/font&gt;&lt;ul&gt;&lt;li&gt;&lt;font size=&quot;2&quot;&gt;Wi-Fi&lt;/font&gt;&lt;/li&gt;&lt;/ul&gt;&lt;font size=&quot;2&quot;&gt;&lt;/font&gt;,10_image.jpg,�f���b�N�X�c�C��(31.5�u),�a��(46.8�u),���������̐_���������\����������u�L�ؘO�v�A���{�����u������v�A�R�[�q�[�V���b�v�u�t�H�[�V�[�Y���Y�v�ȂǁA���ʂȃ��X�g���������p�ӂ������܂����B,�X�J�C�o���P�b�g�@���E����,�����{�݂ɗאڂ��Ă���֗�,10_image1.jpg,10_image2.jpg,10_image3.jpg,10_image4.jpg,10_image5.jpg,34.74324128,137.3708931
11,�h���{��,�r�W�l�X�z�e��,�L���r�W�l�X�z�e��,�Ƃ�͂��т��˂��قĂ�,�L���s�ԉ���12,,0532-55-9222,,,,,,,,,,26,16:00,10:00,,,,"�V���O��3,800�~�`�i�ō�)",�L���w����k��7��,����i30��j,,"1��3,800�~�`�A���H�t�̃��[�Y�i�u���z�e���I&lt;br&gt;�a�H���⋏�����Ȃǂ����݂ŁA�H�E�V�E�x���v���̂܂܁B&lt;br&gt;&lt;ul&gt;&lt;li&gt;&lt;a href=&quot;http://www.honokuni.or.jp/toyohashi/restaurant/000179.html&quot;&gt;����Ԃ���Ԃ炭�y�k�a�H�l&lt;/a&gt;&lt;/li&gt;&lt;li&gt;���H�t&lt;/li&gt;&lt;li&gt;Wi-Fi&lt;/li&gt;&lt;li&gt;P30��&lt;br&gt;&lt;/li&gt;&lt;/ul&gt;",11_image.jpg,,,,,,,,,,,34.76571691,137.3873001
12,�h���{��,���]�[�g�z�e��,�V�[�p���X���]�[�g,���[�ςꂷ�肼�[��,�L���s�_��V�c���~�m��1-3,,0532-32-8811,,,,,,,,,,50,15:00,10:00,,,http://www.sea-palace.co.jp/,"�P���Q�H13,000�~�`�i�ō��j",�L���w����Ԃ�15��,����,,�O�͘p���݂Ɍ��S�Ă̋q�����I�[�V�����r���[�̃��]�[�g�z�e���B&lt;br&gt;&lt;div&gt;�Ƒ���O���[�v�̗��p���������߁B&lt;/div&gt;&lt;div&gt;&lt;ul&gt;&lt;li&gt;P250��&lt;/li&gt;&lt;li&gt;Wi-Fi&lt;/li&gt;&lt;li&gt;�嗁��&lt;/li&gt;&lt;li&gt;���E�[�H�t&lt;br&gt;&lt;/li&gt;&lt;/ul&gt;&lt;/div&gt;,12_image.jpg,,,,,,,,,,,34.76074587,137.323029
13,�h���{��,�V�e�B�z�e��,�z�e���A�\�V�A�L��,�قĂ邠�������Ƃ�͂�,�L���s�ԓc�����h,,0532-57-1010,,,,,,,,,,222,14:00,12:00,,,http://www.associa.com/tyh/,"�V���O��9,000�~�`",�i�q�E���S�L���w����,��g���ԏꂠ��,,&lt;p&gt;&lt;font color=&quot;#0000cc&quot;&gt;&lt;a class=&quot;lightview&quot; href=&quot;/toyohashi/ufile/library/4_file.jpg&quot; rel=&quot;gallery[group2]&quot;&gt;&lt;img style=&quot;WIDTH: 130px; HEIGHT: 102px&quot; src=&quot;/toyohashi/ufile/library/4_file.jpg&quot; width=&quot;100&quot; height=&quot;118&quot; border=&quot;0&quot; align=&quot;right&quot;&gt;&lt;/a&gt;&lt;/font&gt;&lt;font color=&quot;#000000&quot;&gt;&lt;strong&gt;���S�n�̗ǂ���ǋ������Q�X�g���[�����㎿�Ȃ��났�����񑩂��܂�&lt;/strong&gt;&lt;/font&gt;&lt;/p&gt;&lt;p&gt;&amp;nbsp;&lt;/p&gt;&lt;p&gt;�r�W�l�X�⃊���N�[�[�V�����ȂǁA�ړI�ʂɑI�ׂ�Q�X�g���[���B�������ꂽ���_���ȕ��͋C�Ƃ₷�炬����ǋ������C���e���A�B���S�n�̗ǂ���ǋ������㎿�ȋ�Ԃ����p�ӂ������܂����B�J��13���N���}�������܂ł̌o���Ǝ��т����ƂɁA�������ꂽ�A�\�V�A�u�����h�̂��������������ĂȂ��ŊF�l�����}���������܂��B&lt;/p&gt;&lt;p&gt;&amp;nbsp;&lt;/p&gt;&lt;p&gt;�� �S���A�ő�100Mbps�̍����C���^�[�l�b�g����𖳗��ł����p���������܂��B&lt;/p&gt;,13_image.jpg,�r�W�l�X�ɂ����W���[�ɂ��A�N�Z�X�֗��ȉw��̗��n�B�J�ɂ��G��邱�ƂȂ��`�F�b�N�C�����\�ł�,�V���v���Ȃ�������K�����d���B������ʂ̍L���f�X�N�Ńr�W�l�X���p�ɐl�C�̃��f���[�g�V���O��,���w�K�Ɉʒu���A�������Ƃ����R�O�u�̍L�������Ƒ��ł̂����p�ɂ��œK�ȁA�X�[�y���A�c�C��,�����H�͂P�e���X�g�������W�F�[���ɂāA�L�x�Ɏ�葵�����a�m�o�C�L���O���������オ�肢�������܂�,�����p�ړI�ɍ��킹���A��ς����ȃV�[�Y���v�������e�킲�p�ӂ��Ă���܂��B�ڂ����͂g�o��������������,13_image1.jpg,13_image2.jpg,13_image3.jpg,13_image4.jpg,13_image5.jpg,34.76318736,137.3826519
15,�h���{��,����,�i�c���ʊ�,�Ȃ߂ׂ�����,�L���s�Ί�����R93-7,,0532-88�]0111,,,,,,,,,,10,15:00,10:00,,,http://natsume.sub.jp/,"�P���Q�H8,640�~�`�i���E�[�H�t�j",�L���w����Ԃ�30��,����,,���R�̒��ŐÂ��ȓ������B&lt;br&gt;�O�͘p�܂ň�]�ł���I�V���C�͎����ł��B&lt;br&gt;&lt;ul&gt;&lt;li&gt;P30��&lt;/li&gt;&lt;li&gt;Wi-Fi&lt;/li&gt;&lt;li&gt;�嗁��&lt;br&gt;&lt;/li&gt;&lt;/ul&gt;,15_image.jpg,,,,,,,,,,,34.7883252,137.4543795
16,�h���{��,�r�W�l�X�z�e��,�j���[���m�z�e���P,�ɂ�[�Ƃ��悤�قĂ�1,�L���s���͒�2,,0532-32-7000,,,,,,,,,,70,15:30,10:00,,,http://www.new-toyo.com/,"�V���O��5,500�~�`",�L���w����k��1��,����i40��j,,�L���w�������k��90�b�B��ʒ��ԏꖳ���B&lt;br&gt;�H�������낢��A2�H�t���h���v�����D�]���\�񏳂蒆�B&lt;br&gt;&lt;ul&gt;&lt;li&gt;&lt;a href=&quot;http://www.honokuni.or.jp/toyohashi/restaurant/000105.html&quot;&gt;�j���[���m�z�e�� ���k�a�H�l&lt;/a&gt;&lt;/li&gt;&lt;li&gt;���H�t&lt;/li&gt;&lt;li&gt;Wi-Fi&lt;br&gt;&lt;/li&gt;&lt;/ul&gt;,16_image.jpg,,,,,,,,,,,34.76148625,137.3789826
18,�h���{��,�r�W�l�X�z�e��,�r�W�l�X�z�e���͂���,�т��˂��قĂ�͂���,�L���s���O�Ԓ�8,,0532-46-4441,,,,,,,,,,33,16:00,10:00,,,http://www.hotel-hashira.com/,"�V���O��4,900�~",�L���w����Ԃ�4��,����i25��j,,�ߗׂɈ��H�X�Ȃǂ���������A�؍݂ɂ͑�ϕ֗��ł��B&lt;br&gt;&lt;div&gt;���ʒ��ԏꂪ��������Ă��āA�����ɂ��o�������܂��B&lt;/div&gt;&lt;div&gt;&lt;ul&gt;&lt;li&gt;Wi-Fi&lt;br&gt;&lt;/li&gt;&lt;/ul&gt;&lt;/div&gt;,18_image.jpg,,,,,,,,,,,34.74953128,137.3775074
19,�h���{��,����,�O�Ŋ�,�܂����΂���,�L���s�O�Œ��l�V�c61-1,,0532-31-0027,,,,,,,,,,13,15:00,10:00,,,http://www.maeshibakan.jp/,"�P���Q�H8,640�~�`�i���E�[�H�t�j",�L���w����Ԃ�20��,����,,"&lt;div&gt;�V�N�ȊC�̍K�̖L���Ȗ��킢�ɐ�ہB&lt;/div&gt;&lt;div&gt;����ɂ��r�W�l�X�R�[�X�ɂ��B&lt;br&gt;�r�W�l�X�R�[�X6,000�~�`&lt;br&gt;&lt;ul&gt;&lt;li&gt;P30��&lt;/li&gt;&lt;li&gt;Wi-Fi&lt;/li&gt;&lt;li&gt;�嗁��&lt;br&gt;&lt;/li&gt;&lt;/ul&gt;&lt;/div&gt;",19_image.jpg,,,,,,,,,,,34.78051809,137.3317677
21,�h���{��,�r�W�l�X�z�e��,�L���X�e�[�V�����z�e��,�Ƃ�͂����ā[�����قĂ�,�L���s�����c����103,,0532-56-1919,,,,,,,,,,102,15:00,10:00,,,http://kuretake-inn.com/station/toyo/,"�V���O��4,700�~�`",�L���w����k��5��,����i30��j,,&lt;font face=&quot;�l�r �o�S�V�b�N&quot;&gt;&lt;/font&gt;&lt;p style=&quot;margin: 0mm 0mm 0pt;&quot;&gt;&lt;span style=&quot;color: black; font-family: ���C���I; font-size: 10pt;&quot;&gt;�L���w�������k��5���B&lt;/span&gt;&lt;/p&gt;&lt;font face=&quot;�l�r �o�S�V�b�N&quot;&gt;&lt;/font&gt;&lt;p style=&quot;margin: 0mm 0mm 0pt;&quot;&gt;&lt;span style=&quot;color: black; font-family: ���C���I; font-size: 10pt;&quot;&gt;��D�]�̒��H�o�C�L���O�����I&lt;/span&gt;&lt;/p&gt;&lt;p style=&quot;margin: 0mm 0mm 0pt;&quot;&gt;&lt;span style=&quot;color: black; font-family: ���C���I; font-size: 10pt;&quot;&gt;�����h�����N�T�[�r�X�I�J���[���C�X�E���r�[��������܂��B&lt;/span&gt;&lt;/p&gt;&lt;ul&gt;&lt;li&gt;&lt;span style=&quot;color: black; font-family: ���C���I; font-size: 10pt;&quot;&gt;Wi-Fi&lt;/span&gt;&lt;/li&gt;&lt;li&gt;&lt;span style=&quot;color: black; font-family: ���C���I; font-size: 10pt;&quot;&gt;���H�t&lt;br&gt;&lt;/span&gt;&lt;/li&gt;&lt;/ul&gt;&lt;font face=&quot;�l�r �o�S�V�b�N&quot;&gt;&lt;/font&gt;,21_image.jpg,�V���O��,�_�u��,�n�b�s�[�A���[,�[�H�����J���[���C�X,�������H�o�C�L���O,21_image1.jpg,21_image2.jpg,21_image3.jpg,21_image4.jpg,21_image5.jpg,34.75959341,137.385098
22,�h���{��,�r�W�l�X�z�e��,�����C���@�L���w����,�Ƃ��悱����@�Ƃ�͂������Ђ�������,�L���s�勴�ʂQ-�P�R�T,,0532-81-1045 ,,,,,,,,,,135,16:00,10:00,,,http://www.toyoko-inn.com/hotel/00195/index.html,"�V���O��6,600�~�`",�L���w����k��3��,����i30��j,,���ł�����y���i�ň��S�B&lt;br&gt;�����ŉ��K�ɂ��߂������������܂��B&lt;br&gt;�w�O�ŕ֗��ł��B���蒩�H�������܂��B&lt;br&gt;�����z�[���y�[�W����̂��\�񂪂����ł��I&lt;br&gt;&lt;ul&gt;&lt;li&gt;Wi-Fi&lt;/li&gt;&lt;li&gt;���H�t&lt;/li&gt;&lt;/ul&gt;,22_image.jpg,,,,,,,,,,,34.76594166,137.3830354
23,�h���{��,���]�[�g�z�e��,�ɗǌ΃V�[�p�[�N���X�p,���炲���[�ρ[������ǂ���,�c���s�ɗǌΒ��{��2822-2,,0531-35-1500,,,,,,,,,,122,15:00,11:00,,,http://www.irago.net/,�F�X�ȃv����������܂��BHP���������������B,�L���w���爭�����u�O�͓c���w�v���ԃz�e�����}�o�X�i���S�\�񐧁j��40��,����,,&lt;br&gt;,23_image.jpg,,,,,,,,,,,34.5875205,137.0266128
24,�h���{��,�V�e�B�z�e��,�z�e���A�[�N���b�V���L��,�قĂ邠�[���������Ƃ�͂�,�L���s�w�O���1-55,,0532-51-1111,,,,,,,,,,91,14:00,12:00,,,http://www.arcriche.jp/,"�V���O��9,000�~�`",�L���w����k��2��,��g���ԏꂠ��,,�L���w�����O�Ɉʒu����㎿�ŃX�^�C���b�V���ȃz�e���B&lt;br&gt;��p���E���W��t�B�b�g�l�X�Ȃǎ{�݂��[���B&lt;br&gt;&lt;ul&gt;&lt;li&gt;Wi-Fi&lt;br&gt;&lt;/li&gt;&lt;/ul&gt;,24_image.jpg,,,,,,,,,,,34.7625175,137.3841539
25,�h���{��,�r�W�l�X�z�e��,�j���[���m�z�e���Q,�ɂ�[�Ƃ��悤�قĂ�Q,�L���s���ʒ�98-1,,0532-33-1000,,,,,,,,,,87,15:30,10:00,,,http://www.new-toyo.com,"�V���O��5,500�~�`",�L���w����k��5��,����i50��j,,�뉀�t�嗁��ő���L�΂��Ă�����肭�났�B&lt;br&gt;�L���w�������k��5���̂₷�炬��ԁB&lt;br&gt;���ʒ��ԏꖳ���B&lt;br&gt;&lt;ul&gt;&lt;li&gt;Wi-Fi&lt;/li&gt;&lt;li&gt;�嗁��&lt;/li&gt;&lt;li&gt;P50��&lt;/li&gt;&lt;/ul&gt;,25_image.jpg,,,,,,,,,,,34.75815226,137.381233
26,�h���{��,�r�W�l�X�z�e��,�r�W�l�X�z�e���������� �@�x�C�T�C�h�X,�т��˂��قĂ邨������@�ׂ������ǂĂ�,�L���s�_��V�c�����m��176-1,,0532-47-1112,,,,,,,,,,75,16:00,10:00,,,http://www.toyohashi.com/,"�V���O��4,700�~�`",�L���w����ԂŖ�P�T��,����i50��j,,���C���H�ƒc�n�⃉�O�[�i�e���{�X�ւ̃A�N�Z�X���ǂ��A�r�W�l�X�⃌�W���[�̊ό����_�Ƃ��Ă���ϕ֗��B&lt;br&gt;&lt;ul&gt;&lt;li&gt;Wi-Fi&lt;/li&gt;&lt;li&gt;�嗁��&lt;br&gt;&lt;/li&gt;&lt;/ul&gt;,26_image.jpg,,,,,,26_image1.jpg,26_image2.jpg,26_image3.jpg,26_image4.jpg,26_image5.jpg,34.72697629,137.3532495
27,�ό��X�|�b�g,���j,���h�{�w������,�ӂ����킵�キ�ق񂶂񂵂�傤����,�L���s��쒬������65�Ԓn,,0532-41-8580,,,"9�F30	17�F00�i���ق�16�F30�܂Łj","		","		","		",,1,�i���������j�����j���܂��͐U�֋x���̏ꍇ�͂��̗������j�A12/29�`1/1,,,,,,http://www.futagawa-honjin.jp/,���400�~�A��������100�~�i�c�̊�����������j,�i�q�w���w�x�k�����ԁA����1�q�i�k��15���j,����,,&lt;span style=&quot;font-family: &amp;quot;�l�r �S�V�b�N&amp;quot;; font-size: 12pt; mso-hansi-font-family: Century; mso-bidi-font-family: &amp;quot;Times New Roman&amp;quot;; mso-font-kerning: 1.0pt; mso-ansi-language: EN-US; mso-fareast-language: JA; mso-bidi-language: AR-SA;&quot;&gt;�]�ˎ���̌�ʂƒn��̗��j�����Ƃ����R���Z�v�g�̂��ƁA�u���C���v�u���h�v�u�{�w�v�Ƃ���3�̃e�[�}�œW�����s�������قł��B���h�̐��藧���A�ߐ��̗����ʂ̗l�q���킩��₷���W���E������Ă��܂��B�ٓ��ɂ͏h�������ю��ӂ��ڂ�����������j�Ճ}�b�v���ݒu����Ă���A�܂������قɗאڂ��Ă�����h�̈�\�́A�]�ˎ������̕���4�N&lt;span lang=&quot;EN-US&quot;&gt;(1807&lt;/span&gt;�N&lt;span lang=&quot;EN-US&quot;&gt;)&lt;/span&gt;�����&lt;span lang=&quot;EN-US&quot;&gt;60&lt;/span&gt;�N�Ԗ{�w���΂߂��n��Ƃ̈�\�ŁA�@���ɂ͍]�ˎ���̓y����剮�A���֓��A�\�傪�c���Ă��܂��B���C�A�����H���ɂ�薾���ȍ~���󂳂�Ă������@���𕜌��A�{�w�̍ł��������ꂽ�p���Č����܂����B�喼�̋x�e�ꏊ�ł�������i�̊Ԃ��͂��߁A�{�w�̑S�e�����w�ł��܂��B&lt;/span&gt;,27_image.jpg,���{�w,���{�w,���{�w,���{�w,���{�w,27_image1.jpg,27_image2.jpg,27_image3.jpg,27_image4.jpg,27_image5.jpg,34.72329479,137.4498171
28,�ό��X�|�b�g,�����فE�{��,�_��V�c������,����̂���ł񂵂�傤����,�L���s�_��V�c������O66,,0532-45-7476,,,"9�F00	16�F00","		","		","		",,"6	7	8",�Ċ��i���~�j�E�N���N�n�i12/30�`1/4�j,,,,,,,����,�L�S�o�X�i���C���j�w���C�w�Z�O�x���ԓk��10��,����,,&lt p&gt �S�N�O�A�x�d�Ȃ鎩�R�ЊQ�ɁA�ї��V�c����ł�������󂯂āA����@�_����V�����́A��M�Ɖp�m�A�����̍ŐV�Z�p����g�����搂�͂̎p�������āA���ɁA�_��V�c�J��ɐ������܂����B���̈̋ƂƐ��_���㐢�ɓ`������؂Ƃ��Ċe�K�e�[�}�ʂɓW���A�����������l�B�̊J��̐����ƕ��݂����܂�Ă���J�񎑗��قł��B&lt /p&gt ,28_image.jpg,�_��V�c������,�_��V�c������,�_��V�c������,�_��V�c������,�_��V�c������,28_image1.jpg,28_image2.jpg,28_image3.jpg,28_image4.jpg,28_image5.jpg,34.74444245,137.3594883
29,�ό��X�|�b�g,�����فE�{��,�L���s��������������,�Ƃ�͂����݂񂼂�����傤���イ��������,�L���s���Ē���m�J34-1-1,�L���s���p������,0532-51-2882,,,"�y�j���E���j��	9�F30	16�F30","		","		","		",,"1	2	3	4	5	8",�N���N�n�i12��29���`1��3���j,,,,,,,����,�s�d�w�Ԋ���x���ԁA�L�S�o�X(�ё�����)��芷���w�����c�n�x����,����,,�L���s���ɗB�ꌻ������ؑ��Z�ɂ𗘗p���A�L���E���O�͒n�悩����W���ꂽ���������i��1000�_�j��W�����Ă��܂��B�܂��A�~�n�����܂߂��ׂĂ��̂̂܂܂ł��邱�Ƃ���A�f��E�h���}�̕���Ƃ��Ē��ڂ��W�߂Ă��܂��B,29_image.jpg,��������������,��������������,��������������,��������������,��������������,29_image1.jpg,29_image2.jpg,29_image3.jpg,29_image4.jpg,29_image5.jpg,34.7625219,137.4505734
30,�ό��X�|�b�g,�����فE�{��,�L���s���p������,�Ƃ�͂����т���͂��Ԃ���,�L���s������3-1,,0532-51-2882,,,"9�F00	17�F00","		","		","		",,1,�N���N�n�i12��29���`1��3���j�E���W�J�Ò��̌��j�����j���̏ꍇ�͊J�ق��A�����̉Ηj�����x�قƂȂ�܂�,,,,,,http://www.toyohashi-bihaku.jp/,��ʃM�������[����я�ݓW�͖����B���W�͍Â��ɂ���Ă����̂Ō����T�C�g�Q��,�s�d�w�L�������O�x���ԓk��3��,����,,&lt p&gt ���a54(1979)�N6��1���ɗΖL���ȖL������(�g�c�隬)�̈�p�ɊJ�ق��A���y�䂩��̔��p����j�E�l�ÁE���������𒆐S�Ɏ��W�E�W�����s���ق��A���W�̊J�ÁA�u�����u���̊J�u�ȂǕ��y�����ɂ��Ƃ߂Ă��܂��B�܂��A1�K�W�����ł͊e����p�W�A�O���[�v�W�Ȃǂ̍�i���\�̏�Ƃ��čL����ʂɊ��p����Ă��܂��B&lt /p&gt,30_image.jpg,�L���s���p������,�L���s���p������,�L���s���p������,�L���s���p������,�L���s���p������,30_image1.jpg,30_image2.jpg,30_image3.jpg,30_image4.jpg,30_image5.jpg,34.76935906,137.3948016
31,�ό��X�|�b�g,�����فE�{��,�L���s�n�������قƖL���s�����o����Z���^�[,�Ƃ�͂������������񂩂�ƂƂ�͂��������傤�������傤�������񂽁[,�L���s��⒬���Αō�19-16,,0532-41-2833,,9�F00�`16�F30,"		","		","		","		",,1,���T���j���i���������j�����j���܂��͐U�֋x���̏ꍇ�͂��̗����j,,,,,,http://www.toyohaku.gr.jp/chika/,���ꖳ���i�������v���l�^���E���͑�l150�~�@���l30�~�j,�i�q�w���w�x����k��10��,����,��^�o�X�o�L��,���E�̍z���E�z�΁A�����ޗ��A�n�������A�C�m�J���A�G�l���M�[���W������Ă��܂��B�ٓ������͎O�d���̋I�B�z�R�̍B����͂������̂ɂȂ��Ă���A�B�v�̐l�`���u���ꂨ��A�z�R�S���̎ԗ������W������Ă��܂��B�܂��A���݂̖L���s�����o����Z���^�[�ɂ͒��a17���[�g���̃v���l�^���E��������A�e�q�Ŋy���ނ��Ƃ��ł��܂��B,31_image.jpg,�����o����Z���^�[,�����o����Z���^�[,�v���l�^���E��,�n���������Z���^�[,�n���������Z���^�[,31_image1.jpg,31_image2.jpg,31_image3.jpg,31_image4.jpg,31_image5.jpg,34.72928872,137.4314573
32,�ό��X�|�b�g,�����فE�{��,���ǂ������ف@�����ɂ�,���ǂ��݂炢����@�����ɂ�,�L���s���t��3����1,,0532-21-5525,0532-56-5552,,"9�F30	��׻ނɂ��قȂ�","		","		","		",,3,�i���j�����j���܂��͐U�֋x���̏ꍇ�͊J�فj�N���N�n�i12��29���`1��1���j,,,,,,http://www.coconico.jp/,�̌��E�����v���U�܂���ԑ�l200�~���ǂ��i���������j100�~�B�W���v���U�����̏ꍇ�͗L���B���͖����B,�i�q�E���S�L���w����k��10���܂��͖L�S�o�X�w���ǂ������فE���H��c���O�x���Ԃ���,����,,&lt p&gt ������S���q�ǂ��������A�y�����V�т�A�l�X�Ȑl�Ƃ̂ӂꂠ�����Ƃ����āA���₩�ɐ�������@���񋟂��Ă��܂��B�l�X�̐���̎s���������E�𗬂��鋒�_�ƂȂ�A�܂��Ȃ��ɂɂ��킢��y�����𔭐M���Ă����܂��B���W�����A���C���A�X�^�W�I�A�������K���Ȃǂ�����Ă��܂��B&lt /p&gt ,32_image.jpg,�����ɂ��E�Ő��L��,�����ɂ��E������,�܂����,�}���R�[�i�[,�h���[���^�E��,32_image1.jpg,32_image2.jpg,32_image3.jpg,32_image4.jpg,32_image5.jpg,34.76840502,137.3836684
33,�ό��X�|�b�g,���̑�,���꒲���r,�΂�΂��傤��������,�L���s���ԑ򒬎����993�Ԓn,,�@,,,"		","		","		","		",,,,,,,,,,����,�吴���w���L�S�o�X(���C�N�^�E����)�w���C�N�q���Y�����x���ԓk��20��,����,,"&lt;div&gt;&lt;div&gt;1993�N�v�H�����L��p���̒����r�ŁA��n���@�킵�đ��������n�_���B&lt;/div&gt;&lt;div&gt;�A�X�t�@���g�t�F�C�V���O�t�B���_���ŗL�������e��5,000��?�B&lt;/div&gt;&lt;div&gt;���͂ɂ̓e�j�X�R�[�g��A��؂�ʕ������`�[�t�ɂ����V����ԗV����������܂��B&lt;/div&gt;&lt;div&gt;1����3.3�����̎���R�[�X�����邽�߁A�E�H�[�L���O��W���M���O���y���ސl�̎p�������܂��B&lt;/div&gt;&lt;/div&gt;&lt;div&gt;&lt;br&gt;&lt;/div&gt;",33_image.jpg,���꒲���r�W�]��,���꒲���r�V��,���̓W����,���̓W����,���̓W����,33_image1.jpg,33_image2.jpg,,,,34.67134556,137.3487622
34,�ό��X�|�b�g,�����فE�{��,�O�͍`�i�L���G���A�j�ƃJ�������A,�݂���i�Ƃ�͂����肠�j�Ƃ����߂肠,�L���s�_��ӓ���3-29,,0532-34-3712,,,"����	9�F00	17�F00","�W�]���i4�`9���j�y�E���E�j	9�F00	20�F00","�W�]���i10���`3���j�y�E���E�j	9�F00	19�F00","		", ,,�N���N�n(12��29���`1��3��),,,,,,http://www.port-mikawa.jp/area/kamomeria.php,����,�L�S�o�X(�_��ӓ���)�w�`�p�������Ɂx����2��,����,,�O�͍`�i�L���G���A�j�͓��{��̎����ԗA���`�p�Ƃ��đS���I�ɒm���A�����O�̑�莩���ԉ�Ђ̗A�o���ɗ��p����Ă��܂��B�܂��A�|�[�g�C���t�H���[�V�����Z���^�[�u�J�������A�v�́u���{��̎����ԍ`�p�A�O�͍`��m��E�w�ԁE�y���ށv���e�[�}�ɕ���17�N�Ɋ������܂����B�����ԉ^����p�D�A�R���e�i�D�̖͌^�̓W���A���C�u�f���R�[�i�[�Ȃǂ�����A�W�]���ł͎O�͍`����]�ł��܂��B&lt;br&gt;,34_image.jpg,�J�������A,�J�������A,�J�������A����,�L���`,�L���`,34_image1.jpg,34_image2.jpg,34_image3.jpg,34_image4.jpg,34_image5.jpg,34.73238472,137.3297795
35,�ό��X�|�b�g,�����فE�{��,�A�N�A���[�i�L��,��������[�ȂƂ�͂�,�L���s�_��V�c�����m��1-3,,0532-31-4781,,,"9�F00	21�F00","		","		","		",,1,���j�����j���܂��͐U�֋x���̏ꍇ�͂��̗���,,,,,,http://hamada-sports.com/toyohashi/,�ڂ����͌����T�C�g��,�L�S�o�X(�L���s���a�@�E���c�n��)�w�����X�|�[�c�����x���Ԃ���,����,,&lt;div&gt;�āi6���`9���j�̓v�[���A�~�i11���`5���̃S�[���f���E�B�[�N�j�͈��m�����O�͒n��B��̃A�C�X�X�P�[�g��ƂȂ�A���[�j���O���[����������N�Ԃ�ʂ��ăX�|�[�c���s�����^�^���{�݂ł��B&lt;/div&gt;&lt;div&gt;&lt;br&gt;&lt;/div&gt;&lt;div&gt;�v�[����50m�̌��F���Z�v�[����25m�v�[���A�c���p�v�[��������A�X�P�[�g�����N�́A�A�C�X�z�b�P�[�A�V���[�g�g���b�N�A�t�B�M���A�X�P�[�g���Z�ɂ��Ή����Ă��܂��B&lt;/div&gt;,35_image.jpg,�A�N�A���[�i�L��,�A�N�A��[�i�L��,�A�N�A���[�i�L��,�A�N�A���[�i�L��,�A�N�A���[�i�L��,35_image1.jpg,35_image2.jpg,35_image3.jpg,35_image4.jpg,35_image5.jpg,34.75852742,137.3232483
36,�ό��X�|�b�g,�����فE�{��,�L���s�����̈��,�Ƃ�͂�����������������������,�L���s�_��V�c�����m��1-3,,0532-32-9611,,,"9�F00	21�F00","		","		","		",,1,���j�����j���܂��͐U�֋x���̏ꍇ�͂��̗���,,,,,,http://www.city.toyohashi.aichi.jp/sports/sisetsu/soutai.html,�ڂ����͌����T�C�g��,�L�S�o�X(�L���s���a�@�E���c�n��)�w�����X�|�[�c�����x���Ԃ���,����,,�s���ő�̉����̈�{�݁B�v���o�X�P�b�g�{�[���@�l���E���O�̓t�F�j�b�N�X�̃z�[���A���[�i�̈�Ƃ��Ď������ɂ͑����̃u�[�X�^�[�i�t�@���j�œ��키�B���ɂ����낢��ȃX�|�[�c�̑��Ȃǂ̉��Ƃ��ė��p����Ă���B,36_image.jpg,�L���s�����̈��,�L���s�����̈��,�L���s�����̈��,�L���s�����̈��,�L���s�����̈��,36_image1.jpg,36_image2.jpg,36_image3.jpg,36_image4.jpg,36_image5.jpg,34.75814124,137.3249589
37,�ό��X�|�b�g,�����فE�{��,�������Z���^�[,�����񂩂��񂽁[,�L���s�L�h������530�Ԓn,,0532-46-5304,,,"9�F00	12�F00","13�F00	16�F00","		","		",,,�y�E���E�j�y�єN���N�n�i12��29���`1��3���j,,,,,,http://www.city.toyohashi.aichi.jp/shigenkacenter/index.html,,�L�S�o�X(�L���Z�ȑ��)�w�肷�ϖL���x����k��3��,����,,�L���s�������Z���^�[�ċp�{�݂́A�����R�Ăɂ��啝�ȃ_�C�I�L�V���}���A�D�ꂽ�ċp�]�M�̗��p�y�ы����ނ̉���A�X�ɗn�Z�X���O�̎������ȂǁA���ɗD�����A�����z�^�́u�M�����E�����R�ėn�Z�F�v�����鎟����^�ƌĂ΂��K�X���n�Z�Z�p��p�����ŐV�̂��ݏ����{�݂ł��B�ٓ��͓������܂������Ȃ��������i����Ɏ��悤�ɂ킩��܂��B,37_image.jpg,�������Z���^�[,�������Z���^�[,����,���T�C�N���v���U,���w�R�[�X��,37_image1.jpg,37_image2.jpg,37_image3.jpg,37_image4.jpg,37_image5.jpg,34.69756655,137.4227335
38,�ό��X�|�b�g,�����فE�{��,�L���s���,�Ƃ�͂������������ǂ�,�L���s������2����22,,0532-51-3077,,,"9�F00	22�F00","		","		","		",,,������3���j���i�������A��3���j���������̏j�����͐U�֋x���ɓ�����Ƃ��́A���̗����j�N���N�n�i12��29���`1��3���j,,,,,,http://www.bunzai.or.jp/publichall/,�����z�[���y�[�W�ɂ�,�s���d�ԁw�s�����O�x���Ԃ���,�Ȃ�,,&lt p&gt ���a6�N�i1931�j���z�̔����h�[���Ƙh���V���{���̃��}�l�X�N�l���̌����ŁA���w��o�^�������B�����ȗ������̍Â����s���A���݂��u����̊J�Â⎮�T�A���x���A�̗w�����L�����p����Ă��܂��B�ߋ��ɂ͑����m�푈�����Ɏs�����@�\���ڂ��ꂽ������A�L�����������ق�s�������Z���^�[�Ƃ��Ďg�p���ꂽ����������܂����B&lt /p&gt,38_image.jpg,���,���,��z�[��,���ڎ�,��i,38_image1.jpg,38_image2.jpg,38_image3.jpg,38_image4.jpg,38_image5.jpg,34.76814117,137.3922642
39,�ό��X�|�b�g,�_�ЁE���t,�n���X�g�X������,�͂肷�Ƃ��������傤����,�L���s������3-15,,0532-54-0434,,���R�i�O�ς̂݁B�������w�͗v�\��j,"		","		","		","		",,,,,,,,,,����,�s�d�w�s�����O�x���ԓk��3��,�Ȃ�,,&lt P&gt ���V�A������̐M�҂��������吳2�N�ɏ���_���̃}�g�t�F�C�e�c����35���N���L�O���ĐV�z���ꂽ������ŁA�������錧���̐�����̒��ōŌÂ̐����ł��B��Ђ�Ƃꂽ���߁A����̋L�^��M�d�ȕ����E�����Ȑ������ �R�����̐�����E�n���������p�H�|�i�����ۑ�����Ă��܂��B���d�v�������Ɏw��B&lt /P&gt,39_image.jpg,�n���X�g�X������,�n���X�g�X������,�n���X�g�X������,�n���X�g�X������,�n���X�g�X������,39_image1.jpg,39_image2.jpg,39_image3.jpg,39_image4.jpg,39_image5.jpg,34.76814062,137.3940271